program: LAMMPS
programVersion: 29 Sep 2021 - Update 3
lattice: 40.34 0 0
lattice: 0 40.34 0
lattice: 0 0 40.34
formula: H1006
1006 atoms
H  7.5000 14.7400 16.5500
H  7.5000 14.7400 20.1700
H  7.5000 14.7400 23.7900
H  7.5000 16.5500 14.7400
H  7.5000 16.5500 18.3600
H  7.5000 18.3600 16.5500
H  7.5000 16.5500 21.9800
H  7.5000 18.3600 20.1700
H  7.5000 16.5500 25.6000
H  7.5000 18.3600 23.7900
H  7.5000 20.1700 14.7400
H  7.5000 20.1700 18.3600
H  7.5000 21.9800 16.5500
H  7.5000 20.1700 21.9800
H  7.5000 21.9800 20.1700
H  7.5000 20.1700 25.6000
H  7.5000 21.9800 23.7900
H  7.5000 23.7900 14.7400
H  7.5000 23.7900 18.3600
H  7.5000 25.6000 16.5500
H  7.5000 23.7900 21.9800
H  7.5000 25.6000 20.1700
H  7.5000 23.7900 25.6000
H  7.5000 25.6000 23.7900
H  11.1200 11.1200 16.5500
H  11.1200 11.1200 20.1700
H  11.1200 11.1200 23.7900
H  9.3100 14.7400 14.7400
H  11.1200 12.9300 14.7400
H  11.1200 14.7400 12.9300
H  9.3100 12.9300 16.5500
H  9.3100 14.7400 18.3600
H  11.1200 12.9300 18.3600
H  11.1200 14.7400 16.5500
H  9.3100 12.9300 20.1700
H  9.3100 14.7400 21.9800
H  11.1200 12.9300 21.9800
H  11.1200 14.7400 20.1700
H  9.3100 12.9300 23.7900
H  9.3100 14.7400 25.6000
H  11.1200 12.9300 25.6000
H  11.1200 14.7400 23.7900
H  11.1200 14.7400 27.4100
H  11.1200 16.5500 11.1200
H  9.3100 16.5500 12.9300
H  9.3100 18.3600 14.7400
H  11.1200 16.5500 14.7400
H  11.1200 18.3600 12.9300
H  9.3100 16.5500 16.5500
H  9.3100 18.3600 18.3600
H  11.1200 16.5500 18.3600
H  11.1200 18.3600 16.5500
H  9.3100 16.5500 20.1700
H  9.3100 18.3600 21.9800
H  11.1200 16.5500 21.9800
H  11.1200 18.3600 20.1700
H  9.3100 16.5500 23.7900
H  9.3100 18.3600 25.6000
H  11.1200 16.5500 25.6000
H  11.1200 18.3600 23.7900
H  9.3100 16.5500 27.4100
H  11.1200 16.5500 29.2200
H  11.1200 18.3600 27.4100
H  11.1200 20.1700 11.1200
H  9.3100 20.1700 12.9300
H  9.3100 21.9800 14.7400
H  11.1200 20.1700 14.7400
H  11.1200 21.9800 12.9300
H  9.3100 20.1700 16.5500
H  9.3100 21.9800 18.3600
H  11.1200 20.1700 18.3600
H  11.1200 21.9800 16.5500
H  9.3100 20.1700 20.1700
H  9.3100 21.9800 21.9800
H  11.1200 20.1700 21.9800
H  11.1200 21.9800 20.1700
H  9.3100 20.1700 23.7900
H  9.3100 21.9800 25.6000
H  11.1200 20.1700 25.6000
H  11.1200 21.9800 23.7900
H  9.3100 20.1700 27.4100
H  11.1200 20.1700 29.2200
H  11.1200 21.9800 27.4100
H  11.1200 23.7900 11.1200
H  9.3100 23.7900 12.9300
H  9.3100 25.6000 14.7400
H  11.1200 23.7900 14.7400
H  11.1200 25.6000 12.9300
H  9.3100 23.7900 16.5500
H  9.3100 25.6000 18.3600
H  11.1200 23.7900 18.3600
H  11.1200 25.6000 16.5500
H  9.3100 23.7900 20.1700
H  9.3100 25.6000 21.9800
H  11.1200 23.7900 21.9800
H  11.1200 25.6000 20.1700
H  9.3100 23.7900 23.7900
H  9.3100 25.6000 25.6000
H  11.1200 23.7900 25.6000
H  11.1200 25.6000 23.7900
H  9.3100 23.7900 27.4100
H  11.1200 23.7900 29.2200
H  11.1200 25.6000 27.4100
H  11.1200 27.4100 14.7400
H  9.3100 27.4100 16.5500
H  11.1200 27.4100 18.3600
H  11.1200 29.2200 16.5500
H  9.3100 27.4100 20.1700
H  11.1200 27.4100 21.9800
H  11.1200 29.2200 20.1700
H  9.3100 27.4100 23.7900
H  11.1200 27.4100 25.6000
H  11.1200 29.2200 23.7900
H  14.7400 7.5000 16.5500
H  14.7400 7.5000 20.1700
H  14.7400 7.5000 23.7900
H  12.9300 11.1200 14.7400
H  14.7400 9.3100 14.7400
H  14.7400 11.1200 12.9300
H  12.9300 9.3100 16.5500
H  12.9300 11.1200 18.3600
H  14.7400 9.3100 18.3600
H  14.7400 11.1200 16.5500
H  12.9300 9.3100 20.1700
H  12.9300 11.1200 21.9800
H  14.7400 9.3100 21.9800
H  14.7400 11.1200 20.1700
H  12.9300 9.3100 23.7900
H  12.9300 11.1200 25.6000
H  14.7400 9.3100 25.6000
H  14.7400 11.1200 23.7900
H  14.7400 11.1200 27.4100
H  12.9300 14.7400 11.1200
H  14.7400 12.9300 11.1200
H  14.7400 14.7400 9.3100
H  12.9300 12.9300 12.9300
H  12.9300 14.7400 14.7400
H  14.7400 12.9300 14.7400
H  14.7400 14.7400 12.9300
H  12.9300 12.9300 16.5500
H  12.9300 14.7400 18.3600
H  14.7400 12.9300 18.3600
H  14.7400 14.7400 16.5500
H  12.9300 12.9300 20.1700
H  12.9300 14.7400 21.9800
H  14.7400 12.9300 21.9800
H  14.7400 14.7400 20.1700
H  12.9300 12.9300 23.7900
H  12.9300 14.7400 25.6000
H  14.7400 12.9300 25.6000
H  14.7400 14.7400 23.7900
H  12.9300 12.9300 27.4100
H  12.9300 14.7400 29.2200
H  14.7400 12.9300 29.2200
H  14.7400 14.7400 27.4100
H  14.7400 14.7400 31.0300
H  14.7400 16.5500 7.5000
H  12.9300 16.5500 9.3100
H  12.9300 18.3600 11.1200
H  14.7400 16.5500 11.1200
H  14.7400 18.3600 9.3100
H  12.9300 16.5500 12.9300
H  12.9300 18.3600 14.7400
H  14.7400 16.5500 14.7400
H  14.7400 18.3600 12.9300
H  12.9300 16.5500 16.5500
H  12.9300 18.3600 18.3600
H  14.7400 16.5500 18.3600
H  14.7400 18.3600 16.5500
H  12.9300 16.5500 20.1700
H  12.9300 18.3600 21.9800
H  14.7400 16.5500 21.9800
H  14.7400 18.3600 20.1700
H  12.9300 16.5500 23.7900
H  12.9300 18.3600 25.6000
H  14.7400 16.5500 25.6000
H  14.7400 18.3600 23.7900
H  12.9300 16.5500 27.4100
H  12.9300 18.3600 29.2200
H  14.7400 16.5500 29.2200
H  14.7400 18.3600 27.4100
H  12.9300 16.5500 31.0300
H  14.7400 16.5500 32.8400
H  14.7400 18.3600 31.0300
H  14.7400 20.1700 7.5000
H  12.9300 20.1700 9.3100
H  12.9300 21.9800 11.1200
H  14.7400 20.1700 11.1200
H  14.7400 21.9800 9.3100
H  12.9300 20.1700 12.9300
H  12.9300 21.9800 14.7400
H  14.7400 20.1700 14.7400
H  14.7400 21.9800 12.9300
H  12.9300 20.1700 16.5500
H  12.9300 21.9800 18.3600
H  14.7400 20.1700 18.3600
H  14.7400 21.9800 16.5500
H  12.9300 20.1700 20.1700
H  12.9300 21.9800 21.9800
H  14.7400 20.1700 21.9800
H  14.7400 21.9800 20.1700
H  12.9300 20.1700 23.7900
H  12.9300 21.9800 25.6000
H  14.7400 20.1700 25.6000
H  14.7400 21.9800 23.7900
H  12.9300 20.1700 27.4100
H  12.9300 21.9800 29.2200
H  14.7400 20.1700 29.2200
H  14.7400 21.9800 27.4100
H  12.9300 20.1700 31.0300
H  14.7400 20.1700 32.8400
H  14.7400 21.9800 31.0300
H  14.7400 23.7900 7.5000
H  12.9300 23.7900 9.3100
H  12.9300 25.6000 11.1200
H  14.7400 23.7900 11.1200
H  14.7400 25.6000 9.3100
H  12.9300 23.7900 12.9300
H  12.9300 25.6000 14.7400
H  14.7400 23.7900 14.7400
H  14.7400 25.6000 12.9300
H  12.9300 23.7900 16.5500
H  12.9300 25.6000 18.3600
H  14.7400 23.7900 18.3600
H  14.7400 25.6000 16.5500
H  12.9300 23.7900 20.1700
H  12.9300 25.6000 21.9800
H  14.7400 23.7900 21.9800
H  14.7400 25.6000 20.1700
H  12.9300 23.7900 23.7900
H  12.9300 25.6000 25.6000
H  14.7400 23.7900 25.6000
H  14.7400 25.6000 23.7900
H  12.9300 23.7900 27.4100
H  12.9300 25.6000 29.2200
H  14.7400 23.7900 29.2200
H  14.7400 25.6000 27.4100
H  12.9300 23.7900 31.0300
H  14.7400 23.7900 32.8400
H  14.7400 25.6000 31.0300
H  14.7400 27.4100 11.1200
H  12.9300 27.4100 12.9300
H  12.9300 29.2200 14.7400
H  14.7400 27.4100 14.7400
H  14.7400 29.2200 12.9300
H  12.9300 27.4100 16.5500
H  12.9300 29.2200 18.3600
H  14.7400 27.4100 18.3600
H  14.7400 29.2200 16.5500
H  12.9300 27.4100 20.1700
H  12.9300 29.2200 21.9800
H  14.7400 27.4100 21.9800
H  14.7400 29.2200 20.1700
H  12.9300 27.4100 23.7900
H  12.9300 29.2200 25.6000
H  14.7400 27.4100 25.6000
H  14.7400 29.2200 23.7900
H  12.9300 27.4100 27.4100
H  14.7400 27.4100 29.2200
H  14.7400 29.2200 27.4100
H  14.7400 31.0300 14.7400
H  12.9300 31.0300 16.5500
H  14.7400 31.0300 18.3600
H  14.7400 32.8400 16.5500
H  12.9300 31.0300 20.1700
H  14.7400 31.0300 21.9800
H  14.7400 32.8400 20.1700
H  12.9300 31.0300 23.7900
H  14.7400 31.0300 25.6000
H  14.7400 32.8400 23.7900
H  16.5500 7.5000 14.7400
H  16.5500 7.5000 18.3600
H  18.3600 7.5000 16.5500
H  16.5500 7.5000 21.9800
H  18.3600 7.5000 20.1700
H  16.5500 7.5000 25.6000
H  18.3600 7.5000 23.7900
H  16.5500 11.1200 11.1200
H  16.5500 9.3100 12.9300
H  16.5500 11.1200 14.7400
H  18.3600 9.3100 14.7400
H  18.3600 11.1200 12.9300
H  16.5500 9.3100 16.5500
H  16.5500 11.1200 18.3600
H  18.3600 9.3100 18.3600
H  18.3600 11.1200 16.5500
H  16.5500 9.3100 20.1700
H  16.5500 11.1200 21.9800
H  18.3600 9.3100 21.9800
H  18.3600 11.1200 20.1700
H  16.5500 9.3100 23.7900
H  16.5500 11.1200 25.6000
H  18.3600 9.3100 25.6000
H  18.3600 11.1200 23.7900
H  16.5500 9.3100 27.4100
H  16.5500 11.1200 29.2200
H  18.3600 11.1200 27.4100
H  16.5500 14.7400 7.5000
H  16.5500 12.9300 9.3100
H  16.5500 14.7400 11.1200
H  18.3600 12.9300 11.1200
H  18.3600 14.7400 9.3100
H  16.5500 12.9300 12.9300
H  16.5500 14.7400 14.7400
H  18.3600 12.9300 14.7400
H  18.3600 14.7400 12.9300
H  16.5500 12.9300 16.5500
H  16.5500 14.7400 18.3600
H  18.3600 12.9300 18.3600
H  18.3600 14.7400 16.5500
H  16.5500 12.9300 20.1700
H  16.5500 14.7400 21.9800
H  18.3600 12.9300 21.9800
H  18.3600 14.7400 20.1700
H  16.5500 12.9300 23.7900
H  16.5500 14.7400 25.6000
H  18.3600 12.9300 25.6000
H  18.3600 14.7400 23.7900
H  16.5500 12.9300 27.4100
H  16.5500 14.7400 29.2200
H  18.3600 12.9300 29.2200
H  18.3600 14.7400 27.4100
H  16.5500 12.9300 31.0300
H  16.5500 14.7400 32.8400
H  18.3600 14.7400 31.0300
H  16.5500 18.3600 7.5000
H  18.3600 16.5500 7.5000
H  16.5500 16.5500 9.3100
H  16.5500 18.3600 11.1200
H  18.3600 16.5500 11.1200
H  18.3600 18.3600 9.3100
H  16.5500 16.5500 12.9300
H  16.5500 18.3600 14.7400
H  18.3600 16.5500 14.7400
H  18.3600 18.3600 12.9300
H  16.5500 16.5500 16.5500
H  16.5500 18.3600 18.3600
H  18.3600 16.5500 18.3600
H  18.3600 18.3600 16.5500
H  16.5500 16.5500 20.1700
H  16.5500 18.3600 21.9800
H  18.3600 16.5500 21.9800
H  18.3600 18.3600 20.1700
H  16.5500 16.5500 23.7900
H  16.5500 18.3600 25.6000
H  18.3600 16.5500 25.6000
H  18.3600 18.3600 23.7900
H  16.5500 16.5500 27.4100
H  16.5500 18.3600 29.2200
H  18.3600 16.5500 29.2200
H  18.3600 18.3600 27.4100
H  16.5500 16.5500 31.0300
H  16.5500 18.3600 32.8400
H  18.3600 16.5500 32.8400
H  18.3600 18.3600 31.0300
H  16.5500 21.9800 7.5000
H  18.3600 20.1700 7.5000
H  16.5500 20.1700 9.3100
H  16.5500 21.9800 11.1200
H  18.3600 20.1700 11.1200
H  18.3600 21.9800 9.3100
H  16.5500 20.1700 12.9300
H  16.5500 21.9800 14.7400
H  18.3600 20.1700 14.7400
H  18.3600 21.9800 12.9300
H  16.5500 20.1700 16.5500
H  16.5500 21.9800 18.3600
H  18.3600 20.1700 18.3600
H  18.3600 21.9800 16.5500
H  16.5500 20.1700 20.1700
H  16.5500 21.9800 21.9800
H  18.3600 20.1700 21.9800
H  18.3600 21.9800 20.1700
H  16.5500 20.1700 23.7900
H  16.5500 21.9800 25.6000
H  18.3600 20.1700 25.6000
H  18.3600 21.9800 23.7900
H  16.5500 20.1700 27.4100
H  16.5500 21.9800 29.2200
H  18.3600 20.1700 29.2200
H  18.3600 21.9800 27.4100
H  16.5500 20.1700 31.0300
H  16.5500 21.9800 32.8400
H  18.3600 20.1700 32.8400
H  18.3600 21.9800 31.0300
H  16.5500 25.6000 7.5000
H  18.3600 23.7900 7.5000
H  16.5500 23.7900 9.3100
H  16.5500 25.6000 11.1200
H  18.3600 23.7900 11.1200
H  18.3600 25.6000 9.3100
H  16.5500 23.7900 12.9300
H  16.5500 25.6000 14.7400
H  18.3600 23.7900 14.7400
H  18.3600 25.6000 12.9300
H  16.5500 23.7900 16.5500
H  16.5500 25.6000 18.3600
H  18.3600 23.7900 18.3600
H  18.3600 25.6000 16.5500
H  16.5500 23.7900 20.1700
H  16.5500 25.6000 21.9800
H  18.3600 23.7900 21.9800
H  18.3600 25.6000 20.1700
H  16.5500 23.7900 23.7900
H  16.5500 25.6000 25.6000
H  18.3600 23.7900 25.6000
H  18.3600 25.6000 23.7900
H  16.5500 23.7900 27.4100
H  16.5500 25.6000 29.2200
H  18.3600 23.7900 29.2200
H  18.3600 25.6000 27.4100
H  16.5500 23.7900 31.0300
H  16.5500 25.6000 32.8400
H  18.3600 23.7900 32.8400
H  18.3600 25.6000 31.0300
H  16.5500 27.4100 9.3100
H  16.5500 29.2200 11.1200
H  18.3600 27.4100 11.1200
H  16.5500 27.4100 12.9300
H  16.5500 29.2200 14.7400
H  18.3600 27.4100 14.7400
H  18.3600 29.2200 12.9300
H  16.5500 27.4100 16.5500
H  16.5500 29.2200 18.3600
H  18.3600 27.4100 18.3600
H  18.3600 29.2200 16.5500
H  16.5500 27.4100 20.1700
H  16.5500 29.2200 21.9800
H  18.3600 27.4100 21.9800
H  18.3600 29.2200 20.1700
H  16.5500 27.4100 23.7900
H  16.5500 29.2200 25.6000
H  18.3600 27.4100 25.6000
H  18.3600 29.2200 23.7900
H  16.5500 27.4100 27.4100
H  16.5500 29.2200 29.2200
H  18.3600 27.4100 29.2200
H  18.3600 29.2200 27.4100
H  16.5500 27.4100 31.0300
H  16.5500 31.0300 12.9300
H  16.5500 32.8400 14.7400
H  18.3600 31.0300 14.7400
H  16.5500 31.0300 16.5500
H  16.5500 32.8400 18.3600
H  18.3600 31.0300 18.3600
H  18.3600 32.8400 16.5500
H  16.5500 31.0300 20.1700
H  16.5500 32.8400 21.9800
H  18.3600 31.0300 21.9800
H  18.3600 32.8400 20.1700
H  16.5500 31.0300 23.7900
H  16.5500 32.8400 25.6000
H  18.3600 31.0300 25.6000
H  18.3600 32.8400 23.7900
H  16.5500 31.0300 27.4100
H  20.1700 7.5000 14.7400
H  20.1700 7.5000 18.3600
H  21.9800 7.5000 16.5500
H  20.1700 7.5000 21.9800
H  21.9800 7.5000 20.1700
H  20.1700 7.5000 25.6000
H  21.9800 7.5000 23.7900
H  20.1700 11.1200 11.1200
H  20.1700 9.3100 12.9300
H  20.1700 11.1200 14.7400
H  21.9800 9.3100 14.7400
H  21.9800 11.1200 12.9300
H  20.1700 9.3100 16.5500
H  20.1700 11.1200 18.3600
H  21.9800 9.3100 18.3600
H  21.9800 11.1200 16.5500
H  20.1700 9.3100 20.1700
H  20.1700 11.1200 21.9800
H  21.9800 9.3100 21.9800
H  21.9800 11.1200 20.1700
H  20.1700 9.3100 23.7900
H  20.1700 11.1200 25.6000
H  21.9800 9.3100 25.6000
H  21.9800 11.1200 23.7900
H  20.1700 9.3100 27.4100
H  20.1700 11.1200 29.2200
H  21.9800 11.1200 27.4100
H  20.1700 14.7400 7.5000
H  20.1700 12.9300 9.3100
H  20.1700 14.7400 11.1200
H  21.9800 12.9300 11.1200
H  21.9800 14.7400 9.3100
H  20.1700 12.9300 12.9300
H  20.1700 14.7400 14.7400
H  21.9800 12.9300 14.7400
H  21.9800 14.7400 12.9300
H  20.1700 12.9300 16.5500
H  20.1700 14.7400 18.3600
H  21.9800 12.9300 18.3600
H  21.9800 14.7400 16.5500
H  20.1700 12.9300 20.1700
H  20.1700 14.7400 21.9800
H  21.9800 12.9300 21.9800
H  21.9800 14.7400 20.1700
H  20.1700 12.9300 23.7900
H  20.1700 14.7400 25.6000
H  21.9800 12.9300 25.6000
H  21.9800 14.7400 23.7900
H  20.1700 12.9300 27.4100
H  20.1700 14.7400 29.2200
H  21.9800 12.9300 29.2200
H  21.9800 14.7400 27.4100
H  20.1700 12.9300 31.0300
H  20.1700 14.7400 32.8400
H  21.9800 14.7400 31.0300
H  20.1700 18.3600 7.5000
H  21.9800 16.5500 7.5000
H  20.1700 16.5500 9.3100
H  20.1700 18.3600 11.1200
H  21.9800 16.5500 11.1200
H  21.9800 18.3600 9.3100
H  20.1700 16.5500 12.9300
H  20.1700 18.3600 14.7400
H  21.9800 16.5500 14.7400
H  21.9800 18.3600 12.9300
H  20.1700 16.5500 16.5500
H  20.1700 18.3600 18.3600
H  21.9800 16.5500 18.3600
H  21.9800 18.3600 16.5500
H  20.1700 16.5500 20.1700
H  20.1700 18.3600 21.9800
H  21.9800 16.5500 21.9800
H  21.9800 18.3600 20.1700
H  20.1700 16.5500 23.7900
H  20.1700 18.3600 25.6000
H  21.9800 16.5500 25.6000
H  21.9800 18.3600 23.7900
H  20.1700 16.5500 27.4100
H  20.1700 18.3600 29.2200
H  21.9800 16.5500 29.2200
H  21.9800 18.3600 27.4100
H  20.1700 16.5500 31.0300
H  20.1700 18.3600 32.8400
H  21.9800 16.5500 32.8400
H  21.9800 18.3600 31.0300
H  20.1700 21.9800 7.5000
H  21.9800 20.1700 7.5000
H  20.1700 20.1700 9.3100
H  20.1700 21.9800 11.1200
H  21.9800 20.1700 11.1200
H  21.9800 21.9800 9.3100
H  20.1700 20.1700 12.9300
H  20.1700 21.9800 14.7400
H  21.9800 20.1700 14.7400
H  21.9800 21.9800 12.9300
H  20.1700 20.1700 16.5500
H  20.1700 21.9800 18.3600
H  21.9800 20.1700 18.3600
H  21.9800 21.9800 16.5500
H  20.1700 20.1700 20.1700
H  20.1700 21.9800 21.9800
H  21.9800 20.1700 21.9800
H  21.9800 21.9800 20.1700
H  20.1700 20.1700 23.7900
H  20.1700 21.9800 25.6000
H  21.9800 20.1700 25.6000
H  21.9800 21.9800 23.7900
H  20.1700 20.1700 27.4100
H  20.1700 21.9800 29.2200
H  21.9800 20.1700 29.2200
H  21.9800 21.9800 27.4100
H  20.1700 20.1700 31.0300
H  20.1700 21.9800 32.8400
H  21.9800 20.1700 32.8400
H  21.9800 21.9800 31.0300
H  20.1700 25.6000 7.5000
H  21.9800 23.7900 7.5000
H  20.1700 23.7900 9.3100
H  20.1700 25.6000 11.1200
H  21.9800 23.7900 11.1200
H  21.9800 25.6000 9.3100
H  20.1700 23.7900 12.9300
H  20.1700 25.6000 14.7400
H  21.9800 23.7900 14.7400
H  21.9800 25.6000 12.9300
H  20.1700 23.7900 16.5500
H  20.1700 25.6000 18.3600
H  21.9800 23.7900 18.3600
H  21.9800 25.6000 16.5500
H  20.1700 23.7900 20.1700
H  20.1700 25.6000 21.9800
H  21.9800 23.7900 21.9800
H  21.9800 25.6000 20.1700
H  20.1700 23.7900 23.7900
H  20.1700 25.6000 25.6000
H  21.9800 23.7900 25.6000
H  21.9800 25.6000 23.7900
H  20.1700 23.7900 27.4100
H  20.1700 25.6000 29.2200
H  21.9800 23.7900 29.2200
H  21.9800 25.6000 27.4100
H  20.1700 23.7900 31.0300
H  20.1700 25.6000 32.8400
H  21.9800 23.7900 32.8400
H  21.9800 25.6000 31.0300
H  20.1700 27.4100 9.3100
H  20.1700 29.2200 11.1200
H  21.9800 27.4100 11.1200
H  20.1700 27.4100 12.9300
H  20.1700 29.2200 14.7400
H  21.9800 27.4100 14.7400
H  21.9800 29.2200 12.9300
H  20.1700 27.4100 16.5500
H  20.1700 29.2200 18.3600
H  21.9800 27.4100 18.3600
H  21.9800 29.2200 16.5500
H  20.1700 27.4100 20.1700
H  20.1700 29.2200 21.9800
H  21.9800 27.4100 21.9800
H  21.9800 29.2200 20.1700
H  20.1700 27.4100 23.7900
H  20.1700 29.2200 25.6000
H  21.9800 27.4100 25.6000
H  21.9800 29.2200 23.7900
H  20.1700 27.4100 27.4100
H  20.1700 29.2200 29.2200
H  21.9800 27.4100 29.2200
H  21.9800 29.2200 27.4100
H  20.1700 27.4100 31.0300
H  20.1700 31.0300 12.9300
H  20.1700 32.8400 14.7400
H  21.9800 31.0300 14.7400
H  20.1700 31.0300 16.5500
H  20.1700 32.8400 18.3600
H  21.9800 31.0300 18.3600
H  21.9800 32.8400 16.5500
H  20.1700 31.0300 20.1700
H  20.1700 32.8400 21.9800
H  21.9800 31.0300 21.9800
H  21.9800 32.8400 20.1700
H  20.1700 31.0300 23.7900
H  20.1700 32.8400 25.6000
H  21.9800 31.0300 25.6000
H  21.9800 32.8400 23.7900
H  20.1700 31.0300 27.4100
H  23.7900 7.5000 14.7400
H  23.7900 7.5000 18.3600
H  25.6000 7.5000 16.5500
H  23.7900 7.5000 21.9800
H  25.6000 7.5000 20.1700
H  23.7900 7.5000 25.6000
H  25.6000 7.5000 23.7900
H  23.7900 11.1200 11.1200
H  23.7900 9.3100 12.9300
H  23.7900 11.1200 14.7400
H  25.6000 9.3100 14.7400
H  25.6000 11.1200 12.9300
H  23.7900 9.3100 16.5500
H  23.7900 11.1200 18.3600
H  25.6000 9.3100 18.3600
H  25.6000 11.1200 16.5500
H  23.7900 9.3100 20.1700
H  23.7900 11.1200 21.9800
H  25.6000 9.3100 21.9800
H  25.6000 11.1200 20.1700
H  23.7900 9.3100 23.7900
H  23.7900 11.1200 25.6000
H  25.6000 9.3100 25.6000
H  25.6000 11.1200 23.7900
H  23.7900 9.3100 27.4100
H  23.7900 11.1200 29.2200
H  25.6000 11.1200 27.4100
H  23.7900 14.7400 7.5000
H  23.7900 12.9300 9.3100
H  23.7900 14.7400 11.1200
H  25.6000 12.9300 11.1200
H  25.6000 14.7400 9.3100
H  23.7900 12.9300 12.9300
H  23.7900 14.7400 14.7400
H  25.6000 12.9300 14.7400
H  25.6000 14.7400 12.9300
H  23.7900 12.9300 16.5500
H  23.7900 14.7400 18.3600
H  25.6000 12.9300 18.3600
H  25.6000 14.7400 16.5500
H  23.7900 12.9300 20.1700
H  23.7900 14.7400 21.9800
H  25.6000 12.9300 21.9800
H  25.6000 14.7400 20.1700
H  23.7900 12.9300 23.7900
H  23.7900 14.7400 25.6000
H  25.6000 12.9300 25.6000
H  25.6000 14.7400 23.7900
H  23.7900 12.9300 27.4100
H  23.7900 14.7400 29.2200
H  25.6000 12.9300 29.2200
H  25.6000 14.7400 27.4100
H  23.7900 12.9300 31.0300
H  23.7900 14.7400 32.8400
H  25.6000 14.7400 31.0300
H  23.7900 18.3600 7.5000
H  25.6000 16.5500 7.5000
H  23.7900 16.5500 9.3100
H  23.7900 18.3600 11.1200
H  25.6000 16.5500 11.1200
H  25.6000 18.3600 9.3100
H  23.7900 16.5500 12.9300
H  23.7900 18.3600 14.7400
H  25.6000 16.5500 14.7400
H  25.6000 18.3600 12.9300
H  23.7900 16.5500 16.5500
H  23.7900 18.3600 18.3600
H  25.6000 16.5500 18.3600
H  25.6000 18.3600 16.5500
H  23.7900 16.5500 20.1700
H  23.7900 18.3600 21.9800
H  25.6000 16.5500 21.9800
H  25.6000 18.3600 20.1700
H  23.7900 16.5500 23.7900
H  23.7900 18.3600 25.6000
H  25.6000 16.5500 25.6000
H  25.6000 18.3600 23.7900
H  23.7900 16.5500 27.4100
H  23.7900 18.3600 29.2200
H  25.6000 16.5500 29.2200
H  25.6000 18.3600 27.4100
H  23.7900 16.5500 31.0300
H  23.7900 18.3600 32.8400
H  25.6000 16.5500 32.8400
H  25.6000 18.3600 31.0300
H  23.7900 21.9800 7.5000
H  25.6000 20.1700 7.5000
H  23.7900 20.1700 9.3100
H  23.7900 21.9800 11.1200
H  25.6000 20.1700 11.1200
H  25.6000 21.9800 9.3100
H  23.7900 20.1700 12.9300
H  23.7900 21.9800 14.7400
H  25.6000 20.1700 14.7400
H  25.6000 21.9800 12.9300
H  23.7900 20.1700 16.5500
H  23.7900 21.9800 18.3600
H  25.6000 20.1700 18.3600
H  25.6000 21.9800 16.5500
H  23.7900 20.1700 20.1700
H  23.7900 21.9800 21.9800
H  25.6000 20.1700 21.9800
H  25.6000 21.9800 20.1700
H  23.7900 20.1700 23.7900
H  23.7900 21.9800 25.6000
H  25.6000 20.1700 25.6000
H  25.6000 21.9800 23.7900
H  23.7900 20.1700 27.4100
H  23.7900 21.9800 29.2200
H  25.6000 20.1700 29.2200
H  25.6000 21.9800 27.4100
H  23.7900 20.1700 31.0300
H  23.7900 21.9800 32.8400
H  25.6000 20.1700 32.8400
H  25.6000 21.9800 31.0300
H  23.7900 25.6000 7.5000
H  25.6000 23.7900 7.5000
H  23.7900 23.7900 9.3100
H  23.7900 25.6000 11.1200
H  25.6000 23.7900 11.1200
H  25.6000 25.6000 9.3100
H  23.7900 23.7900 12.9300
H  23.7900 25.6000 14.7400
H  25.6000 23.7900 14.7400
H  25.6000 25.6000 12.9300
H  23.7900 23.7900 16.5500
H  23.7900 25.6000 18.3600
H  25.6000 23.7900 18.3600
H  25.6000 25.6000 16.5500
H  23.7900 23.7900 20.1700
H  23.7900 25.6000 21.9800
H  25.6000 23.7900 21.9800
H  25.6000 25.6000 20.1700
H  23.7900 23.7900 23.7900
H  23.7900 25.6000 25.6000
H  25.6000 23.7900 25.6000
H  25.6000 25.6000 23.7900
H  23.7900 23.7900 27.4100
H  23.7900 25.6000 29.2200
H  25.6000 23.7900 29.2200
H  25.6000 25.6000 27.4100
H  23.7900 23.7900 31.0300
H  23.7900 25.6000 32.8400
H  25.6000 23.7900 32.8400
H  25.6000 25.6000 31.0300
H  23.7900 27.4100 9.3100
H  23.7900 29.2200 11.1200
H  25.6000 27.4100 11.1200
H  23.7900 27.4100 12.9300
H  23.7900 29.2200 14.7400
H  25.6000 27.4100 14.7400
H  25.6000 29.2200 12.9300
H  23.7900 27.4100 16.5500
H  23.7900 29.2200 18.3600
H  25.6000 27.4100 18.3600
H  25.6000 29.2200 16.5500
H  23.7900 27.4100 20.1700
H  23.7900 29.2200 21.9800
H  25.6000 27.4100 21.9800
H  25.6000 29.2200 20.1700
H  23.7900 27.4100 23.7900
H  23.7900 29.2200 25.6000
H  25.6000 27.4100 25.6000
H  25.6000 29.2200 23.7900
H  23.7900 27.4100 27.4100
H  23.7900 29.2200 29.2200
H  25.6000 27.4100 29.2200
H  25.6000 29.2200 27.4100
H  23.7900 27.4100 31.0300
H  23.7900 31.0300 12.9300
H  23.7900 32.8400 14.7400
H  25.6000 31.0300 14.7400
H  23.7900 31.0300 16.5500
H  23.7900 32.8400 18.3600
H  25.6000 31.0300 18.3600
H  25.6000 32.8400 16.5500
H  23.7900 31.0300 20.1700
H  23.7900 32.8400 21.9800
H  25.6000 31.0300 21.9800
H  25.6000 32.8400 20.1700
H  23.7900 31.0300 23.7900
H  23.7900 32.8400 25.6000
H  25.6000 31.0300 25.6000
H  25.6000 32.8400 23.7900
H  23.7900 31.0300 27.4100
H  27.4100 11.1200 14.7400
H  27.4100 9.3100 16.5500
H  27.4100 11.1200 18.3600
H  29.2200 11.1200 16.5500
H  27.4100 9.3100 20.1700
H  27.4100 11.1200 21.9800
H  29.2200 11.1200 20.1700
H  27.4100 9.3100 23.7900
H  27.4100 11.1200 25.6000
H  29.2200 11.1200 23.7900
H  27.4100 14.7400 11.1200
H  27.4100 12.9300 12.9300
H  27.4100 14.7400 14.7400
H  29.2200 12.9300 14.7400
H  29.2200 14.7400 12.9300
H  27.4100 12.9300 16.5500
H  27.4100 14.7400 18.3600
H  29.2200 12.9300 18.3600
H  29.2200 14.7400 16.5500
H  27.4100 12.9300 20.1700
H  27.4100 14.7400 21.9800
H  29.2200 12.9300 21.9800
H  29.2200 14.7400 20.1700
H  27.4100 12.9300 23.7900
H  27.4100 14.7400 25.6000
H  29.2200 12.9300 25.6000
H  29.2200 14.7400 23.7900
H  27.4100 12.9300 27.4100
H  27.4100 14.7400 29.2200
H  29.2200 14.7400 27.4100
H  27.4100 16.5500 9.3100
H  27.4100 18.3600 11.1200
H  29.2200 16.5500 11.1200
H  27.4100 16.5500 12.9300
H  27.4100 18.3600 14.7400
H  29.2200 16.5500 14.7400
H  29.2200 18.3600 12.9300
H  27.4100 16.5500 16.5500
H  27.4100 18.3600 18.3600
H  29.2200 16.5500 18.3600
H  29.2200 18.3600 16.5500
H  27.4100 16.5500 20.1700
H  27.4100 18.3600 21.9800
H  29.2200 16.5500 21.9800
H  29.2200 18.3600 20.1700
H  27.4100 16.5500 23.7900
H  27.4100 18.3600 25.6000
H  29.2200 16.5500 25.6000
H  29.2200 18.3600 23.7900
H  27.4100 16.5500 27.4100
H  27.4100 18.3600 29.2200
H  29.2200 16.5500 29.2200
H  29.2200 18.3600 27.4100
H  27.4100 16.5500 31.0300
H  27.4100 20.1700 9.3100
H  27.4100 21.9800 11.1200
H  29.2200 20.1700 11.1200
H  27.4100 20.1700 12.9300
H  27.4100 21.9800 14.7400
H  29.2200 20.1700 14.7400
H  29.2200 21.9800 12.9300
H  27.4100 20.1700 16.5500
H  27.4100 21.9800 18.3600
H  29.2200 20.1700 18.3600
H  29.2200 21.9800 16.5500
H  27.4100 20.1700 20.1700
H  27.4100 21.9800 21.9800
H  29.2200 20.1700 21.9800
H  29.2200 21.9800 20.1700
H  27.4100 20.1700 23.7900
H  27.4100 21.9800 25.6000
H  29.2200 20.1700 25.6000
H  29.2200 21.9800 23.7900
H  27.4100 20.1700 27.4100
H  27.4100 21.9800 29.2200
H  29.2200 20.1700 29.2200
H  29.2200 21.9800 27.4100
H  27.4100 20.1700 31.0300
H  27.4100 23.7900 9.3100
H  27.4100 25.6000 11.1200
H  29.2200 23.7900 11.1200
H  27.4100 23.7900 12.9300
H  27.4100 25.6000 14.7400
H  29.2200 23.7900 14.7400
H  29.2200 25.6000 12.9300
H  27.4100 23.7900 16.5500
H  27.4100 25.6000 18.3600
H  29.2200 23.7900 18.3600
H  29.2200 25.6000 16.5500
H  27.4100 23.7900 20.1700
H  27.4100 25.6000 21.9800
H  29.2200 23.7900 21.9800
H  29.2200 25.6000 20.1700
H  27.4100 23.7900 23.7900
H  27.4100 25.6000 25.6000
H  29.2200 23.7900 25.6000
H  29.2200 25.6000 23.7900
H  27.4100 23.7900 27.4100
H  27.4100 25.6000 29.2200
H  29.2200 23.7900 29.2200
H  29.2200 25.6000 27.4100
H  27.4100 23.7900 31.0300
H  27.4100 27.4100 12.9300
H  27.4100 29.2200 14.7400
H  29.2200 27.4100 14.7400
H  27.4100 27.4100 16.5500
H  27.4100 29.2200 18.3600
H  29.2200 27.4100 18.3600
H  29.2200 29.2200 16.5500
H  27.4100 27.4100 20.1700
H  27.4100 29.2200 21.9800
H  29.2200 27.4100 21.9800
H  29.2200 29.2200 20.1700
H  27.4100 27.4100 23.7900
H  27.4100 29.2200 25.6000
H  29.2200 27.4100 25.6000
H  29.2200 29.2200 23.7900
H  27.4100 27.4100 27.4100
H  27.4100 31.0300 16.5500
H  27.4100 31.0300 20.1700
H  27.4100 31.0300 23.7900
H  31.0300 14.7400 14.7400
H  31.0300 12.9300 16.5500
H  31.0300 14.7400 18.3600
H  32.8400 14.7400 16.5500
H  31.0300 12.9300 20.1700
H  31.0300 14.7400 21.9800
H  32.8400 14.7400 20.1700
H  31.0300 12.9300 23.7900
H  31.0300 14.7400 25.6000
H  32.8400 14.7400 23.7900
H  31.0300 16.5500 12.9300
H  31.0300 18.3600 14.7400
H  32.8400 16.5500 14.7400
H  31.0300 16.5500 16.5500
H  31.0300 18.3600 18.3600
H  32.8400 16.5500 18.3600
H  32.8400 18.3600 16.5500
H  31.0300 16.5500 20.1700
H  31.0300 18.3600 21.9800
H  32.8400 16.5500 21.9800
H  32.8400 18.3600 20.1700
H  31.0300 16.5500 23.7900
H  31.0300 18.3600 25.6000
H  32.8400 16.5500 25.6000
H  32.8400 18.3600 23.7900
H  31.0300 16.5500 27.4100
H  31.0300 20.1700 12.9300
H  31.0300 21.9800 14.7400
H  32.8400 20.1700 14.7400
H  31.0300 20.1700 16.5500
H  31.0300 21.9800 18.3600
H  32.8400 20.1700 18.3600
H  32.8400 21.9800 16.5500
H  31.0300 20.1700 20.1700
H  31.0300 21.9800 21.9800
H  32.8400 20.1700 21.9800
H  32.8400 21.9800 20.1700
H  31.0300 20.1700 23.7900
H  31.0300 21.9800 25.6000
H  32.8400 20.1700 25.6000
H  32.8400 21.9800 23.7900
H  31.0300 20.1700 27.4100
H  31.0300 23.7900 12.9300
H  31.0300 25.6000 14.7400
H  32.8400 23.7900 14.7400
H  31.0300 23.7900 16.5500
H  31.0300 25.6000 18.3600
H  32.8400 23.7900 18.3600
H  32.8400 25.6000 16.5500
H  31.0300 23.7900 20.1700
H  31.0300 25.6000 21.9800
H  32.8400 23.7900 21.9800
H  32.8400 25.6000 20.1700
H  31.0300 23.7900 23.7900
H  31.0300 25.6000 25.6000
H  32.8400 23.7900 25.6000
H  32.8400 25.6000 23.7900
H  31.0300 23.7900 27.4100
H  31.0300 27.4100 16.5500
H  31.0300 27.4100 20.1700
initenergy: -3567.80981046588
energy: -3573.81974487172
