program: LAMMPS
programVersion: 29 Sep 2021 - Update 3
lattice: 40 0 0
lattice: 0 40 0
lattice: 0 0 40
formula: H17He718
735 atoms
He 24.526577 11.852161 22.715947
He 24.526577 11.852161 19.094684
He 24.526577 11.852161 15.473423
He 24.526577 19.094684 11.852161
He 24.526577 17.284053 13.662791
He 24.526577 19.094684 15.473423
He 26.337209 19.094684 13.662791
He 26.337209 17.284053 15.473423
He 24.526577 17.284053 17.284053
He 24.526577 19.094684 19.094684
He 26.337209 17.284053 19.094684
He 26.337209 19.094684 17.284053
He 24.526577 17.284053 20.905316
H  24.526577 19.094684 22.715947
He 26.337209 17.284053 22.715947
He 26.337209 19.094684 20.905316
He 24.526577 17.284053 24.526577
He 24.526577 19.094684 26.337209
He 26.337209 17.284053 26.337209
He 26.337209 19.094684 24.526577
He 24.526577 17.284053 28.147839
He 26.337209 15.473423 24.526577
He 24.526577 15.473423 11.852161
He 24.526577 13.662791 13.662791
He 24.526577 15.473423 15.473423
He 26.337209 13.662791 15.473423
He 26.337209 15.473423 13.662791
He 24.526577 13.662791 17.284053
He 24.526577 15.473423 19.094684
He 26.337209 13.662791 19.094684
He 26.337209 15.473423 17.284053
He 24.526577 13.662791 20.905316
He 24.526577 15.473423 22.715947
He 26.337209 13.662791 22.715947
He 26.337209 15.473423 20.905316
He 24.526577 13.662791 24.526577
He 24.526577 15.473423 26.337209
He 22.715947 24.526577 22.715947
He 22.715947 26.337209 20.905316
He 20.905316 24.526577 24.526577
He 20.905316 26.337209 26.337209
He 22.715947 24.526577 26.337209
He 22.715947 26.337209 24.526577
He 20.905316 24.526577 28.147839
He 22.715947 28.147839 15.473423
He 20.905316 28.147839 17.284053
He 20.905316 29.95847 19.094684
He 22.715947 28.147839 19.094684
He 20.905316 28.147839 20.905316
He 20.905316 29.95847 22.715947
He 22.715947 28.147839 22.715947
He 22.715947 29.95847 20.905316
He 20.905316 28.147839 24.526577
He 20.905316 26.337209 22.715947
He 20.905316 24.526577 20.905316
He 22.715947 24.526577 19.094684
He 20.905316 15.473423 15.473423
He 22.715947 13.662791 15.473423
He 22.715947 15.473423 13.662791
He 20.905316 13.662791 17.284053
He 20.905316 15.473423 19.094684
He 22.715947 13.662791 19.094684
He 22.715947 15.473423 17.284053
He 20.905316 13.662791 20.905316
He 20.905316 15.473423 22.715947
He 22.715947 13.662791 22.715947
He 22.715947 15.473423 20.905316
He 20.905316 13.662791 24.526577
He 20.905316 15.473423 26.337209
He 22.715947 13.662791 26.337209
He 22.715947 15.473423 24.526577
He 22.715947 15.473423 28.147839
He 20.905316 13.662791 13.662791
He 20.905316 15.473423 11.852161
He 20.905316 11.852161 15.473423
He 20.905316 10.04153 17.284053
He 20.905316 11.852161 19.094684
He 22.715947 10.04153 19.094684
He 22.715947 11.852161 17.284053
He 20.905316 10.04153 20.905316
He 20.905316 11.852161 22.715947
He 22.715947 11.852161 20.905316
He 22.715947 11.852161 24.526577
He 22.715947 26.337209 17.284053
He 22.715947 20.905316 11.852161
He 20.905316 20.905316 13.662791
He 20.905316 22.715947 15.473423
He 22.715947 20.905316 15.473423
He 22.715947 22.715947 13.662791
He 20.905316 20.905316 17.284053
He 20.905316 22.715947 19.094684
He 22.715947 20.905316 19.094684
He 22.715947 22.715947 17.284053
He 20.905316 20.905316 20.905316
He 20.905316 22.715947 22.715947
He 22.715947 20.905316 22.715947
He 22.715947 22.715947 20.905316
He 20.905316 20.905316 24.526577
He 20.905316 22.715947 26.337209
He 22.715947 20.905316 26.337209
He 22.715947 22.715947 24.526577
He 20.905316 20.905316 28.147839
He 20.905316 22.715947 29.95847
He 22.715947 20.905316 29.95847
He 22.715947 22.715947 28.147839
He 20.905316 22.715947 11.852161
He 22.715947 24.526577 11.852161
He 20.905316 24.526577 13.662791
He 20.905316 26.337209 15.473423
He 22.715947 24.526577 15.473423
He 22.715947 26.337209 13.662791
He 20.905316 24.526577 17.284053
He 20.905316 26.337209 19.094684
He 20.905316 20.905316 10.04153
He 20.905316 19.094684 26.337209
He 22.715947 17.284053 26.337209
He 22.715947 19.094684 24.526577
He 20.905316 17.284053 28.147839
He 20.905316 19.094684 29.95847
He 22.715947 19.094684 28.147839
He 20.905316 17.284053 24.526577
He 22.715947 19.094684 20.905316
He 20.905316 19.094684 22.715947
He 20.905316 17.284053 10.04153
He 20.905316 19.094684 11.852161
He 22.715947 17.284053 11.852161
H  22.715947 19.094684 10.04153
He 20.905316 17.284053 13.662791
He 20.905316 19.094684 15.473423
He 22.715947 17.284053 15.473423
He 22.715947 19.094684 13.662791
He 20.905316 17.284053 17.284053
He 20.905316 19.094684 19.094684
He 22.715947 17.284053 19.094684
He 22.715947 19.094684 17.284053
He 20.905316 17.284053 20.905316
He 22.715947 17.284053 22.715947
He 28.147839 20.905316 20.905316
He 28.147839 22.715947 22.715947
He 29.95847 20.905316 22.715947
He 29.95847 22.715947 20.905316
He 28.147839 20.905316 24.526577
He 29.95847 20.905316 19.094684
He 28.147839 22.715947 19.094684
He 28.147839 22.715947 15.473423
He 28.147839 20.905316 17.284053
H  28.147839 19.094684 15.473423
He 28.147839 17.284053 17.284053
He 28.147839 19.094684 19.094684
He 29.95847 17.284053 19.094684
He 29.95847 19.094684 17.284053
He 28.147839 17.284053 20.905316
He 28.147839 19.094684 22.715947
He 29.95847 19.094684 20.905316
He 28.147839 17.284053 24.526577
He 28.147839 15.473423 22.715947
He 28.147839 24.526577 17.284053
He 28.147839 24.526577 20.905316
He 28.147839 24.526577 24.526577
He 28.147839 15.473423 15.473423
He 28.147839 15.473423 19.094684
He 24.526577 26.337209 15.473423
He 26.337209 24.526577 15.473423
He 24.526577 24.526577 17.284053
He 24.526577 26.337209 19.094684
He 26.337209 24.526577 19.094684
He 26.337209 26.337209 17.284053
He 24.526577 24.526577 20.905316
He 24.526577 26.337209 22.715947
He 26.337209 24.526577 22.715947
He 26.337209 26.337209 20.905316
He 24.526577 24.526577 24.526577
He 24.526577 26.337209 26.337209
He 26.337209 24.526577 26.337209
He 26.337209 26.337209 24.526577
He 24.526577 24.526577 28.147839
He 24.526577 24.526577 13.662791
He 24.526577 22.715947 11.852161
He 24.526577 20.905316 13.662791
He 24.526577 22.715947 15.473423
He 26.337209 20.905316 15.473423
He 26.337209 22.715947 13.662791
He 24.526577 20.905316 17.284053
He 24.526577 22.715947 19.094684
He 26.337209 20.905316 19.094684
He 26.337209 22.715947 17.284053
He 24.526577 20.905316 20.905316
He 24.526577 22.715947 22.715947
He 26.337209 20.905316 22.715947
He 26.337209 22.715947 20.905316
He 24.526577 20.905316 24.526577
H  24.526577 22.715947 26.337209
He 26.337209 22.715947 24.526577
He 26.337209 20.905316 26.337209
He 24.526577 20.905316 28.147839
He 24.526577 28.147839 24.526577
He 24.526577 28.147839 17.284053
He 24.526577 28.147839 20.905316
He 15.473423 11.852161 17.284053
He 15.473423 11.852161 20.905316
He 15.473423 11.852161 24.526577
He 15.473423 17.284053 11.852161
He 13.662791 17.284053 13.662791
He 13.662791 19.094684 15.473423
He 15.473423 19.094684 13.662791
He 15.473423 17.284053 15.473423
He 13.662791 17.284053 17.284053
He 13.662791 19.094684 19.094684
He 15.473423 17.284053 19.094684
He 15.473423 19.094684 17.284053
He 13.662791 17.284053 20.905316
He 13.662791 19.094684 22.715947
He 15.473423 17.284053 22.715947
He 15.473423 19.094684 20.905316
He 13.662791 17.284053 24.526577
He 13.662791 19.094684 26.337209
He 15.473423 17.284053 26.337209
He 15.473423 19.094684 24.526577
He 15.473423 19.094684 28.147839
He 15.473423 15.473423 28.147839
He 15.473423 15.473423 24.526577
He 13.662791 15.473423 15.473423
He 15.473423 13.662791 15.473423
He 15.473423 15.473423 13.662791
He 13.662791 13.662791 17.284053
He 13.662791 15.473423 19.094684
He 15.473423 13.662791 19.094684
He 15.473423 15.473423 17.284053
He 13.662791 13.662791 20.905316
He 13.662791 15.473423 22.715947
He 15.473423 13.662791 22.715947
He 15.473423 15.473423 20.905316
He 13.662791 13.662791 24.526577
He 13.662791 15.473423 26.337209
He 15.473423 13.662791 26.337209
He 11.852161 24.526577 22.715947
He 11.852161 24.526577 19.094684
He 11.852161 15.473423 17.284053
He 11.852161 15.473423 20.905316
He 11.852161 15.473423 24.526577
He 11.852161 20.905316 15.473423
He 10.04153 20.905316 17.284053
He 10.04153 22.715947 19.094684
He 11.852161 20.905316 19.094684
He 11.852161 22.715947 17.284053
He 10.04153 20.905316 20.905316
He 11.852161 20.905316 22.715947
He 11.852161 22.715947 20.905316
He 11.852161 22.715947 24.526577
He 11.852161 24.526577 15.473423
He 11.852161 19.094684 24.526577
He 11.852161 19.094684 20.905316
He 10.04153 19.094684 22.715947
He 11.852161 17.284053 15.473423
He 10.04153 19.094684 19.094684
He 11.852161 17.284053 19.094684
He 11.852161 19.094684 17.284053
He 10.04153 17.284053 20.905316
H  11.852161 17.284053 22.715947
He 19.094684 22.715947 17.284053
He 17.284053 20.905316 20.905316
He 17.284053 22.715947 22.715947
He 19.094684 20.905316 22.715947
He 19.094684 22.715947 20.905316
He 17.284053 20.905316 24.526577
He 17.284053 22.715947 26.337209
He 19.094684 20.905316 26.337209
He 19.094684 22.715947 24.526577
He 17.284053 20.905316 28.147839
He 19.094684 20.905316 29.95847
He 19.094684 22.715947 28.147839
He 19.094684 20.905316 19.094684
He 17.284053 22.715947 19.094684
He 19.094684 22.715947 13.662791
He 17.284053 20.905316 10.04153
He 17.284053 22.715947 11.852161
He 19.094684 20.905316 11.852161
He 19.094684 22.715947 10.04153
He 17.284053 20.905316 13.662791
He 17.284053 22.715947 15.473423
He 19.094684 20.905316 15.473423
He 17.284053 20.905316 17.284053
He 19.094684 17.284053 29.95847
He 19.094684 13.662791 22.715947
He 19.094684 15.473423 20.905316
He 17.284053 13.662791 24.526577
He 17.284053 15.473423 26.337209
He 19.094684 13.662791 26.337209
He 19.094684 15.473423 24.526577
He 19.094684 15.473423 28.147839
He 19.094684 19.094684 28.147839
He 17.284053 19.094684 11.852161
He 19.094684 17.284053 11.852161
He 19.094684 19.094684 10.04153
He 17.284053 17.284053 13.662791
He 17.284053 19.094684 15.473423
He 19.094684 17.284053 15.473423
He 19.094684 19.094684 13.662791
He 17.284053 17.284053 17.284053
He 17.284053 19.094684 19.094684
He 19.094684 17.284053 19.094684
He 19.094684 19.094684 17.284053
He 17.284053 17.284053 20.905316
He 17.284053 19.094684 22.715947
He 19.094684 17.284053 22.715947
He 19.094684 19.094684 20.905316
He 17.284053 17.284053 24.526577
He 17.284053 19.094684 26.337209
He 19.094684 17.284053 26.337209
He 19.094684 19.094684 24.526577
He 17.284053 17.284053 28.147839
He 17.284053 19.094684 29.95847
He 17.284053 15.473423 22.715947
He 19.094684 28.147839 15.473423
He 17.284053 28.147839 17.284053
He 17.284053 29.95847 19.094684
He 19.094684 28.147839 19.094684
He 19.094684 29.95847 17.284053
He 17.284053 28.147839 20.905316
He 19.094684 28.147839 22.715947
He 19.094684 29.95847 20.905316
He 17.284053 28.147839 24.526577
He 19.094684 26.337209 24.526577
He 19.094684 24.526577 11.852161
He 17.284053 24.526577 13.662791
He 17.284053 26.337209 15.473423
He 19.094684 24.526577 15.473423
He 19.094684 26.337209 13.662791
He 17.284053 24.526577 17.284053
He 17.284053 26.337209 19.094684
He 19.094684 24.526577 19.094684
He 19.094684 26.337209 17.284053
He 17.284053 24.526577 20.905316
He 17.284053 26.337209 22.715947
He 19.094684 24.526577 22.715947
H  19.094684 26.337209 20.905316
He 17.284053 24.526577 24.526577
He 17.284053 26.337209 26.337209
He 19.094684 24.526577 26.337209
He 17.284053 24.526577 28.147839
He 17.284053 13.662791 20.905316
He 19.094684 13.662791 19.094684
He 19.094684 15.473423 17.284053
He 17.284053 11.852161 15.473423
He 17.284053 11.852161 19.094684
He 19.094684 10.04153 19.094684
He 19.094684 11.852161 17.284053
He 17.284053 10.04153 20.905316
He 17.284053 11.852161 22.715947
He 19.094684 10.04153 22.715947
He 19.094684 11.852161 20.905316
He 19.094684 11.852161 24.526577
He 17.284053 15.473423 11.852161
He 17.284053 13.662791 13.662791
He 17.284053 15.473423 15.473423
He 19.094684 13.662791 15.473423
He 19.094684 15.473423 13.662791
He 17.284053 13.662791 17.284053
He 17.284053 15.473423 19.094684
He 13.662791 26.337209 15.473423
He 15.473423 24.526577 15.473423
He 15.473423 26.337209 13.662791
He 13.662791 24.526577 17.284053
He 13.662791 26.337209 19.094684
He 15.473423 24.526577 19.094684
He 15.473423 26.337209 17.284053
He 13.662791 24.526577 20.905316
He 13.662791 26.337209 22.715947
He 15.473423 24.526577 22.715947
He 15.473423 26.337209 20.905316
He 13.662791 24.526577 24.526577
He 15.473423 24.526577 26.337209
He 15.473423 26.337209 24.526577
He 13.662791 24.526577 13.662791
He 15.473423 24.526577 11.852161
He 15.473423 20.905316 11.852161
He 13.662791 20.905316 13.662791
He 13.662791 22.715947 15.473423
He 15.473423 20.905316 15.473423
He 15.473423 22.715947 13.662791
He 13.662791 20.905316 17.284053
He 13.662791 22.715947 19.094684
He 15.473423 20.905316 19.094684
He 15.473423 22.715947 17.284053
He 13.662791 20.905316 20.905316
He 13.662791 22.715947 22.715947
He 15.473423 20.905316 22.715947
He 15.473423 22.715947 20.905316
He 13.662791 20.905316 24.526577
He 13.662791 22.715947 26.337209
He 15.473423 22.715947 24.526577
He 15.473423 20.905316 26.337209
He 15.473423 22.715947 28.147839
He 15.473423 28.147839 15.473423
He 15.473423 28.147839 19.094684
He 15.473423 28.147839 22.715947
He 31.769102 24.526577 20.905316
He 31.769102 15.473423 19.094684
He 31.769102 20.905316 17.284053
He 31.769102 22.715947 19.094684
He 31.769102 20.905316 20.905316
He 31.769102 22.715947 22.715947
He 31.769102 20.905316 24.526577
He 31.769102 19.094684 22.715947
H  31.769102 19.094684 15.473423
He 31.769102 17.284053 17.284053
He 31.769102 19.094684 19.094684
He 31.769102 17.284053 20.905316
He 26.337209 11.852161 17.284053
H  24.526577 10.04153 20.905316
He 26.337209 10.04153 22.715947
H  26.337209 11.852161 20.905316
He 24.526577 10.04153 24.526577
He 24.526577 11.852161 26.337209
He 26.337209 11.852161 24.526577
He 26.337209 10.04153 19.094684
He 26.337209 11.852161 13.662791
H  24.526577 11.852161 11.852161
He 24.526577 10.04153 13.662791
He 26.337209 10.04153 15.473423
He 24.526577 10.04153 17.284053
He 24.526577 8.230898 19.094684
He 24.526577 19.094684 8.230898
He 24.526577 17.284053 10.04153
He 26.337209 17.284053 11.852161
He 26.337209 19.094684 10.04153
He 24.526577 19.094684 29.95847
He 26.337209 17.284053 29.95847
He 26.337209 19.094684 28.147839
H  26.337209 15.473423 28.147839
He 24.526577 15.473423 29.95847
He 24.526577 13.662791 10.04153
He 26.337209 13.662791 11.852161
He 26.337209 15.473423 10.04153
He 26.337209 13.662791 26.337209
He 24.526577 13.662791 28.147839
He 20.905316 8.230898 15.473423
He 20.905316 8.230898 19.094684
He 22.715947 8.230898 17.284053
He 20.905316 8.230898 22.715947
He 22.715947 8.230898 20.905316
He 20.905316 31.769102 20.905316
He 22.715947 31.769102 22.715947
He 20.905316 31.769102 24.526577
He 22.715947 31.769102 19.094684
He 20.905316 31.769102 17.284053
He 20.905316 26.337209 29.95847
He 22.715947 24.526577 29.95847
He 22.715947 26.337209 28.147839
He 20.905316 24.526577 31.769102
He 22.715947 28.147839 11.852161
He 20.905316 28.147839 13.662791
He 20.905316 29.95847 15.473423
He 22.715947 29.95847 13.662791
He 22.715947 29.95847 17.284053
He 20.905316 29.95847 26.337209
He 22.715947 28.147839 26.337209
He 22.715947 29.95847 24.526577
He 20.905316 28.147839 28.147839
He 20.905316 13.662791 28.147839
He 20.905316 15.473423 29.95847
He 22.715947 13.662791 29.95847
He 22.715947 15.473423 10.04153
He 20.905316 15.473423 8.230898
He 20.905316 13.662791 10.04153
He 22.715947 13.662791 11.852161
He 20.905316 11.852161 11.852161
He 20.905316 10.04153 13.662791
He 22.715947 10.04153 15.473423
He 22.715947 11.852161 13.662791
He 22.715947 10.04153 22.715947
He 20.905316 10.04153 24.526577
He 20.905316 11.852161 26.337209
He 22.715947 10.04153 26.337209
He 22.715947 11.852161 28.147839
He 22.715947 22.715947 31.769102
He 22.715947 22.715947 10.04153
He 20.905316 20.905316 31.769102
He 20.905316 24.526577 10.04153
He 20.905316 26.337209 11.852161
He 22.715947 26.337209 10.04153
He 22.715947 20.905316 8.230898
He 22.715947 17.284053 29.95847
He 20.905316 17.284053 31.769102
He 22.715947 19.094684 31.769102
He 20.905316 19.094684 8.230898
He 22.715947 17.284053 8.230898
He 20.905316 22.715947 8.230898
He 29.95847 22.715947 17.284053
He 28.147839 22.715947 26.337209
He 29.95847 20.905316 26.337209
He 29.95847 22.715947 24.526577
He 28.147839 20.905316 28.147839
He 29.95847 22.715947 13.662791
He 28.147839 22.715947 11.852161
He 28.147839 20.905316 13.662791
He 29.95847 20.905316 15.473423
He 29.95847 13.662791 22.715947
He 29.95847 15.473423 20.905316
He 28.147839 13.662791 24.526577
He 28.147839 15.473423 26.337209
He 29.95847 15.473423 24.526577
He 28.147839 19.094684 11.852161
He 28.147839 17.284053 13.662791
He 29.95847 17.284053 15.473423
He 29.95847 19.094684 13.662791
He 29.95847 17.284053 22.715947
He 28.147839 19.094684 26.337209
He 29.95847 17.284053 26.337209
He 29.95847 19.094684 24.526577
He 28.147839 17.284053 28.147839
He 28.147839 28.147839 17.284053
He 28.147839 28.147839 20.905316
He 28.147839 28.147839 24.526577
He 29.95847 26.337209 24.526577
He 28.147839 24.526577 13.662791
He 28.147839 26.337209 15.473423
He 29.95847 24.526577 15.473423
He 28.147839 26.337209 19.094684
He 29.95847 24.526577 19.094684
He 29.95847 26.337209 17.284053
He 28.147839 26.337209 22.715947
He 29.95847 24.526577 22.715947
He 29.95847 26.337209 20.905316
He 28.147839 26.337209 26.337209
He 29.95847 24.526577 26.337209
He 28.147839 24.526577 28.147839
He 28.147839 13.662791 20.905316
He 29.95847 13.662791 19.094684
He 29.95847 15.473423 17.284053
He 28.147839 11.852161 15.473423
He 28.147839 11.852161 19.094684
He 28.147839 11.852161 22.715947
He 28.147839 15.473423 11.852161
He 28.147839 13.662791 13.662791
He 29.95847 13.662791 15.473423
He 29.95847 15.473423 13.662791
He 28.147839 13.662791 17.284053
He 26.337209 26.337209 13.662791
He 24.526577 26.337209 29.95847
He 26.337209 24.526577 29.95847
He 26.337209 26.337209 28.147839
He 24.526577 26.337209 11.852161
He 24.526577 24.526577 10.04153
He 26.337209 24.526577 11.852161
He 24.526577 20.905316 10.04153
He 26.337209 20.905316 11.852161
He 26.337209 22.715947 10.04153
He 24.526577 22.715947 29.95847
He 26.337209 20.905316 29.95847
He 26.337209 22.715947 28.147839
He 24.526577 20.905316 31.769102
H  24.526577 31.769102 20.905316
He 24.526577 29.95847 26.337209
He 26.337209 28.147839 26.337209
He 26.337209 29.95847 24.526577
He 24.526577 28.147839 28.147839
He 26.337209 29.95847 20.905316
He 24.526577 29.95847 22.715947
He 24.526577 28.147839 13.662791
He 24.526577 29.95847 15.473423
He 26.337209 28.147839 15.473423
He 24.526577 29.95847 19.094684
He 26.337209 28.147839 19.094684
H  26.337209 29.95847 17.284053
He 26.337209 28.147839 22.715947
He 13.662791 10.04153 20.905316
He 13.662791 11.852161 22.715947
He 15.473423 10.04153 22.715947
He 13.662791 10.04153 24.526577
He 13.662791 11.852161 26.337209
He 15.473423 10.04153 26.337209
He 15.473423 11.852161 28.147839
He 15.473423 10.04153 19.094684
He 13.662791 11.852161 19.094684
He 15.473423 11.852161 13.662791
He 13.662791 11.852161 15.473423
H  15.473423 10.04153 15.473423
He 13.662791 10.04153 17.284053
He 15.473423 8.230898 20.905316
He 13.662791 17.284053 10.04153
He 13.662791 19.094684 11.852161
He 15.473423 19.094684 10.04153
He 13.662791 17.284053 28.147839
He 13.662791 19.094684 29.95847
He 15.473423 17.284053 29.95847
He 15.473423 19.094684 31.769102
He 15.473423 13.662791 29.95847
He 13.662791 15.473423 29.95847
He 13.662791 15.473423 11.852161
He 15.473423 13.662791 11.852161
He 15.473423 15.473423 10.04153
He 13.662791 13.662791 13.662791
He 13.662791 13.662791 28.147839
He 11.852161 26.337209 20.905316
He 10.04153 24.526577 24.526577
He 11.852161 24.526577 26.337209
He 11.852161 26.337209 24.526577
He 11.852161 28.147839 15.473423
He 11.852161 28.147839 19.094684
He 11.852161 28.147839 22.715947
He 10.04153 26.337209 22.715947
He 10.04153 24.526577 20.905316
He 10.04153 15.473423 15.473423
He 11.852161 13.662791 15.473423
He 11.852161 15.473423 13.662791
He 10.04153 13.662791 17.284053
He 10.04153 15.473423 19.094684
He 11.852161 13.662791 19.094684
He 10.04153 13.662791 20.905316
He 10.04153 15.473423 22.715947
He 11.852161 13.662791 22.715947
He 10.04153 13.662791 24.526577
He 10.04153 15.473423 26.337209
He 11.852161 13.662791 26.337209
He 11.852161 15.473423 28.147839
He 11.852161 11.852161 17.284053
He 11.852161 11.852161 20.905316
He 11.852161 11.852161 24.526577
He 11.852161 26.337209 17.284053
He 11.852161 20.905316 11.852161
He 10.04153 20.905316 13.662791
He 10.04153 22.715947 15.473423
He 11.852161 22.715947 13.662791
He 10.04153 22.715947 22.715947
He 10.04153 20.905316 24.526577
He 10.04153 22.715947 26.337209
He 11.852161 20.905316 26.337209
He 11.852161 22.715947 28.147839
He 11.852161 24.526577 11.852161
He 10.04153 24.526577 13.662791
H  10.04153 26.337209 15.473423
He 11.852161 26.337209 13.662791
H  10.04153 24.526577 17.284053
He 10.04153 26.337209 19.094684
He 10.04153 19.094684 26.337209
He 11.852161 17.284053 26.337209
He 11.852161 19.094684 28.147839
He 10.04153 17.284053 24.526577
He 11.852161 17.284053 11.852161
He 10.04153 17.284053 13.662791
He 10.04153 19.094684 15.473423
He 11.852161 19.094684 13.662791
He 10.04153 17.284053 17.284053
He 19.094684 19.094684 31.769102
He 17.284053 22.715947 29.95847
He 17.284053 20.905316 31.769102
He 19.094684 22.715947 31.769102
He 17.284053 22.715947 8.230898
He 19.094684 20.905316 8.230898
He 17.284053 17.284053 31.769102
He 17.284053 13.662791 28.147839
He 17.284053 15.473423 29.95847
He 19.094684 13.662791 29.95847
He 19.094684 15.473423 31.769102
He 17.284053 17.284053 10.04153
He 19.094684 17.284053 8.230898
He 17.284053 19.094684 8.230898
He 19.094684 28.147839 11.852161
He 17.284053 28.147839 13.662791
He 17.284053 29.95847 15.473423
He 19.094684 29.95847 13.662791
He 17.284053 29.95847 22.715947
He 17.284053 29.95847 26.337209
He 19.094684 28.147839 26.337209
He 19.094684 29.95847 24.526577
He 17.284053 28.147839 28.147839
He 19.094684 26.337209 28.147839
He 19.094684 24.526577 29.95847
He 17.284053 26.337209 29.95847
He 19.094684 24.526577 8.230898
He 17.284053 24.526577 10.04153
He 17.284053 26.337209 11.852161
He 19.094684 26.337209 10.04153
He 17.284053 10.04153 13.662791
He 19.094684 10.04153 15.473423
He 19.094684 11.852161 13.662791
He 17.284053 10.04153 17.284053
He 17.284053 10.04153 24.526577
He 17.284053 11.852161 26.337209
He 19.094684 10.04153 26.337209
He 19.094684 11.852161 28.147839
He 17.284053 11.852161 11.852161
He 17.284053 13.662791 10.04153
He 19.094684 13.662791 11.852161
He 19.094684 15.473423 10.04153
He 19.094684 8.230898 24.526577
He 19.094684 8.230898 20.905316
He 17.284053 8.230898 22.715947
He 17.284053 8.230898 19.094684
He 19.094684 8.230898 17.284053
He 19.094684 31.769102 15.473423
He 17.284053 31.769102 17.284053
He 19.094684 31.769102 19.094684
He 17.284053 31.769102 20.905316
He 19.094684 31.769102 22.715947
He 13.662791 26.337209 26.337209
He 13.662791 24.526577 28.147839
He 15.473423 24.526577 29.95847
He 15.473423 26.337209 28.147839
He 15.473423 26.337209 10.04153
He 13.662791 26.337209 11.852161
He 13.662791 24.526577 10.04153
He 15.473423 20.905316 8.230898
He 13.662791 20.905316 10.04153
He 13.662791 22.715947 11.852161
He 15.473423 22.715947 10.04153
He 13.662791 20.905316 28.147839
He 13.662791 22.715947 29.95847
He 15.473423 20.905316 29.95847
H  15.473423 31.769102 19.094684
He 15.473423 28.147839 26.337209
He 15.473423 29.95847 24.526577
He 13.662791 28.147839 24.526577
He 15.473423 29.95847 20.905316
He 13.662791 29.95847 22.715947
He 15.473423 28.147839 11.852161
He 13.662791 28.147839 13.662791
He 13.662791 29.95847 15.473423
He 15.473423 29.95847 13.662791
He 13.662791 28.147839 17.284053
He 13.662791 29.95847 19.094684
He 15.473423 29.95847 17.284053
He 13.662791 28.147839 20.905316
He 8.230898 22.715947 17.284053
He 8.230898 20.905316 22.715947
He 8.230898 22.715947 20.905316
He 8.230898 20.905316 19.094684
He 8.230898 20.905316 15.473423
He 8.230898 15.473423 20.905316
He 8.230898 17.284053 19.094684
He 8.230898 19.094684 17.284053
He 8.230898 17.284053 22.715947
He 8.230898 19.094684 20.905316
He 8.230898 19.094684 24.526577
initenergy: -2596.55319937615
energy: -2623.44656517158
