program: LAMMPS
programVersion: 29 Sep 2021 - Update 3
lattice: 40 0 0
lattice: 0 40 0
lattice: 0 0 40
formula: H718
718 atoms
H  24.526577 11.852161 22.715947
H  24.526577 11.852161 19.094684
H  24.526577 11.852161 15.473423
H  24.526577 19.094684 11.852161
H  24.526577 19.094684 15.473423
H  26.337209 19.094684 13.662791
H  26.337209 17.284053 15.473423
H  24.526577 19.094684 19.094684
H  26.337209 17.284053 19.094684
H  26.337209 19.094684 17.284053
H  24.526577 17.284053 20.905316
H  24.526577 19.094684 22.715947
H  26.337209 17.284053 22.715947
H  26.337209 19.094684 20.905316
H  24.526577 17.284053 24.526577
H  24.526577 19.094684 26.337209
H  26.337209 17.284053 26.337209
H  26.337209 19.094684 24.526577
H  24.526577 17.284053 28.147839
H  26.337209 15.473423 24.526577
H  24.526577 13.662791 13.662791
H  24.526577 15.473423 15.473423
H  26.337209 13.662791 15.473423
H  26.337209 15.473423 13.662791
H  24.526577 13.662791 17.284053
H  24.526577 15.473423 19.094684
H  26.337209 13.662791 19.094684
H  26.337209 15.473423 17.284053
H  24.526577 13.662791 20.905316
H  24.526577 15.473423 22.715947
H  26.337209 13.662791 22.715947
H  26.337209 15.473423 20.905316
H  24.526577 13.662791 24.526577
H  24.526577 15.473423 26.337209
H  22.715947 24.526577 22.715947
H  22.715947 26.337209 20.905316
H  20.905316 24.526577 24.526577
H  20.905316 26.337209 26.337209
H  22.715947 24.526577 26.337209
H  22.715947 26.337209 24.526577
H  20.905316 24.526577 28.147839
H  22.715947 28.147839 15.473423
H  20.905316 28.147839 17.284053
H  20.905316 29.95847 19.094684
H  22.715947 28.147839 19.094684
H  20.905316 28.147839 20.905316
H  20.905316 29.95847 22.715947
H  22.715947 28.147839 22.715947
H  22.715947 29.95847 20.905316
H  20.905316 28.147839 24.526577
H  20.905316 26.337209 22.715947
H  20.905316 24.526577 20.905316
H  22.715947 24.526577 19.094684
H  20.905316 15.473423 15.473423
H  22.715947 13.662791 15.473423
H  22.715947 15.473423 13.662791
H  20.905316 13.662791 17.284053
H  20.905316 15.473423 19.094684
H  22.715947 13.662791 19.094684
H  22.715947 15.473423 17.284053
H  20.905316 13.662791 20.905316
H  20.905316 15.473423 22.715947
H  22.715947 13.662791 22.715947
H  22.715947 15.473423 20.905316
H  20.905316 13.662791 24.526577
H  20.905316 15.473423 26.337209
H  22.715947 13.662791 26.337209
H  22.715947 15.473423 24.526577
H  22.715947 15.473423 28.147839
H  20.905316 13.662791 13.662791
H  20.905316 15.473423 11.852161
H  20.905316 11.852161 15.473423
H  20.905316 10.04153 17.284053
H  20.905316 11.852161 19.094684
H  22.715947 10.04153 19.094684
H  22.715947 11.852161 17.284053
H  20.905316 10.04153 20.905316
H  20.905316 11.852161 22.715947
H  22.715947 11.852161 20.905316
H  22.715947 11.852161 24.526577
H  22.715947 26.337209 17.284053
H  22.715947 20.905316 11.852161
H  20.905316 20.905316 13.662791
H  20.905316 22.715947 15.473423
H  22.715947 20.905316 15.473423
H  22.715947 22.715947 13.662791
H  20.905316 20.905316 17.284053
H  20.905316 22.715947 19.094684
H  22.715947 20.905316 19.094684
H  22.715947 22.715947 17.284053
H  20.905316 20.905316 20.905316
H  20.905316 22.715947 22.715947
H  22.715947 20.905316 22.715947
H  22.715947 22.715947 20.905316
H  20.905316 20.905316 24.526577
H  20.905316 22.715947 26.337209
H  22.715947 20.905316 26.337209
H  22.715947 22.715947 24.526577
H  20.905316 20.905316 28.147839
H  20.905316 22.715947 29.95847
H  22.715947 20.905316 29.95847
H  22.715947 22.715947 28.147839
H  20.905316 22.715947 11.852161
H  20.905316 24.526577 13.662791
H  20.905316 26.337209 15.473423
H  22.715947 24.526577 15.473423
H  22.715947 26.337209 13.662791
H  20.905316 24.526577 17.284053
H  20.905316 26.337209 19.094684
H  20.905316 20.905316 10.04153
H  20.905316 19.094684 26.337209
H  22.715947 17.284053 26.337209
H  22.715947 19.094684 24.526577
H  20.905316 17.284053 28.147839
H  20.905316 19.094684 29.95847
H  22.715947 19.094684 28.147839
H  20.905316 17.284053 24.526577
H  22.715947 19.094684 20.905316
H  20.905316 19.094684 22.715947
H  20.905316 17.284053 10.04153
H  20.905316 19.094684 11.852161
H  22.715947 17.284053 11.852161
H  22.715947 19.094684 10.04153
H  20.905316 17.284053 13.662791
H  20.905316 19.094684 15.473423
H  22.715947 17.284053 15.473423
H  22.715947 19.094684 13.662791
H  20.905316 17.284053 17.284053
H  20.905316 19.094684 19.094684
H  22.715947 17.284053 19.094684
H  22.715947 19.094684 17.284053
H  20.905316 17.284053 20.905316
H  22.715947 17.284053 22.715947
H  28.147839 20.905316 20.905316
H  28.147839 22.715947 22.715947
H  29.95847 20.905316 22.715947
H  29.95847 22.715947 20.905316
H  28.147839 20.905316 24.526577
H  29.95847 20.905316 19.094684
H  28.147839 22.715947 19.094684
H  28.147839 22.715947 15.473423
H  28.147839 20.905316 17.284053
H  28.147839 19.094684 15.473423
H  28.147839 17.284053 17.284053
H  28.147839 19.094684 19.094684
H  29.95847 17.284053 19.094684
H  29.95847 19.094684 17.284053
H  28.147839 17.284053 20.905316
H  28.147839 19.094684 22.715947
H  29.95847 19.094684 20.905316
H  28.147839 17.284053 24.526577
H  28.147839 15.473423 22.715947
H  28.147839 24.526577 17.284053
H  28.147839 24.526577 20.905316
H  28.147839 24.526577 24.526577
H  28.147839 15.473423 15.473423
H  28.147839 15.473423 19.094684
H  24.526577 26.337209 15.473423
H  26.337209 24.526577 15.473423
H  24.526577 24.526577 17.284053
H  24.526577 26.337209 19.094684
H  26.337209 24.526577 19.094684
H  26.337209 26.337209 17.284053
H  24.526577 24.526577 20.905316
H  24.526577 26.337209 22.715947
H  26.337209 24.526577 22.715947
H  26.337209 26.337209 20.905316
H  24.526577 24.526577 24.526577
H  24.526577 26.337209 26.337209
H  26.337209 24.526577 26.337209
H  26.337209 26.337209 24.526577
H  24.526577 24.526577 28.147839
H  24.526577 24.526577 13.662791
H  24.526577 22.715947 11.852161
H  24.526577 20.905316 13.662791
H  24.526577 22.715947 15.473423
H  26.337209 20.905316 15.473423
H  26.337209 22.715947 13.662791
H  24.526577 20.905316 17.284053
H  24.526577 22.715947 19.094684
H  26.337209 20.905316 19.094684
H  26.337209 22.715947 17.284053
H  24.526577 20.905316 20.905316
H  24.526577 22.715947 22.715947
H  26.337209 20.905316 22.715947
H  26.337209 22.715947 20.905316
H  24.526577 20.905316 24.526577
H  24.526577 22.715947 26.337209
H  26.337209 22.715947 24.526577
H  26.337209 20.905316 26.337209
H  24.526577 20.905316 28.147839
H  24.526577 28.147839 24.526577
H  24.526577 28.147839 17.284053
H  24.526577 28.147839 20.905316
H  15.473423 11.852161 17.284053
H  15.473423 11.852161 20.905316
H  15.473423 11.852161 24.526577
H  15.473423 17.284053 11.852161
H  13.662791 17.284053 13.662791
H  13.662791 19.094684 15.473423
H  15.473423 19.094684 13.662791
H  15.473423 17.284053 15.473423
H  13.662791 17.284053 17.284053
H  13.662791 19.094684 19.094684
H  15.473423 17.284053 19.094684
H  15.473423 19.094684 17.284053
H  13.662791 17.284053 20.905316
H  13.662791 19.094684 22.715947
H  15.473423 17.284053 22.715947
H  15.473423 19.094684 20.905316
H  13.662791 17.284053 24.526577
H  13.662791 19.094684 26.337209
H  15.473423 17.284053 26.337209
H  15.473423 19.094684 24.526577
H  15.473423 19.094684 28.147839
H  15.473423 15.473423 28.147839
H  15.473423 15.473423 24.526577
H  13.662791 15.473423 15.473423
H  15.473423 13.662791 15.473423
H  15.473423 15.473423 13.662791
H  13.662791 13.662791 17.284053
H  13.662791 15.473423 19.094684
H  15.473423 13.662791 19.094684
H  15.473423 15.473423 17.284053
H  13.662791 13.662791 20.905316
H  13.662791 15.473423 22.715947
H  15.473423 13.662791 22.715947
H  15.473423 15.473423 20.905316
H  13.662791 13.662791 24.526577
H  13.662791 15.473423 26.337209
H  15.473423 13.662791 26.337209
H  11.852161 24.526577 22.715947
H  11.852161 24.526577 19.094684
H  11.852161 15.473423 17.284053
H  11.852161 15.473423 20.905316
H  11.852161 15.473423 24.526577
H  11.852161 20.905316 15.473423
H  10.04153 20.905316 17.284053
H  10.04153 22.715947 19.094684
H  11.852161 20.905316 19.094684
H  11.852161 22.715947 17.284053
H  10.04153 20.905316 20.905316
H  11.852161 22.715947 20.905316
H  11.852161 22.715947 24.526577
H  11.852161 24.526577 15.473423
H  11.852161 19.094684 24.526577
H  11.852161 19.094684 20.905316
H  10.04153 19.094684 22.715947
H  11.852161 17.284053 15.473423
H  10.04153 19.094684 19.094684
H  11.852161 17.284053 19.094684
H  11.852161 19.094684 17.284053
H  10.04153 17.284053 20.905316
H  11.852161 17.284053 22.715947
H  19.094684 22.715947 17.284053
H  17.284053 20.905316 20.905316
H  17.284053 22.715947 22.715947
H  19.094684 20.905316 22.715947
H  19.094684 22.715947 20.905316
H  17.284053 20.905316 24.526577
H  17.284053 22.715947 26.337209
H  19.094684 20.905316 26.337209
H  19.094684 22.715947 24.526577
H  17.284053 20.905316 28.147839
H  19.094684 20.905316 29.95847
H  19.094684 22.715947 28.147839
H  19.094684 20.905316 19.094684
H  17.284053 22.715947 19.094684
H  19.094684 22.715947 13.662791
H  17.284053 20.905316 10.04153
H  17.284053 22.715947 11.852161
H  19.094684 22.715947 10.04153
H  17.284053 20.905316 13.662791
H  17.284053 22.715947 15.473423
H  19.094684 20.905316 15.473423
H  17.284053 20.905316 17.284053
H  19.094684 17.284053 29.95847
H  19.094684 13.662791 22.715947
H  19.094684 15.473423 20.905316
H  17.284053 13.662791 24.526577
H  17.284053 15.473423 26.337209
H  19.094684 13.662791 26.337209
H  19.094684 15.473423 24.526577
H  19.094684 15.473423 28.147839
H  19.094684 19.094684 28.147839
H  17.284053 19.094684 11.852161
H  19.094684 17.284053 11.852161
H  19.094684 19.094684 10.04153
H  17.284053 17.284053 13.662791
H  17.284053 19.094684 15.473423
H  19.094684 17.284053 15.473423
H  19.094684 19.094684 13.662791
H  17.284053 17.284053 17.284053
H  17.284053 19.094684 19.094684
H  19.094684 17.284053 19.094684
H  19.094684 19.094684 17.284053
H  17.284053 17.284053 20.905316
H  17.284053 19.094684 22.715947
H  19.094684 17.284053 22.715947
H  19.094684 19.094684 20.905316
H  17.284053 17.284053 24.526577
H  17.284053 19.094684 26.337209
H  19.094684 17.284053 26.337209
H  19.094684 19.094684 24.526577
H  17.284053 17.284053 28.147839
H  17.284053 19.094684 29.95847
H  17.284053 15.473423 22.715947
H  19.094684 28.147839 15.473423
H  17.284053 28.147839 17.284053
H  17.284053 29.95847 19.094684
H  19.094684 28.147839 19.094684
H  17.284053 28.147839 20.905316
H  19.094684 28.147839 22.715947
H  19.094684 29.95847 20.905316
H  19.094684 26.337209 24.526577
H  19.094684 24.526577 11.852161
H  17.284053 24.526577 13.662791
H  17.284053 26.337209 15.473423
H  19.094684 24.526577 15.473423
H  19.094684 26.337209 13.662791
H  17.284053 24.526577 17.284053
H  17.284053 26.337209 19.094684
H  19.094684 24.526577 19.094684
H  19.094684 26.337209 17.284053
H  17.284053 24.526577 20.905316
H  17.284053 26.337209 22.715947
H  19.094684 24.526577 22.715947
H  19.094684 26.337209 20.905316
H  17.284053 24.526577 24.526577
H  17.284053 26.337209 26.337209
H  19.094684 24.526577 26.337209
H  17.284053 24.526577 28.147839
H  17.284053 13.662791 20.905316
H  19.094684 13.662791 19.094684
H  19.094684 15.473423 17.284053
H  17.284053 11.852161 15.473423
H  17.284053 11.852161 19.094684
H  19.094684 10.04153 19.094684
H  19.094684 11.852161 17.284053
H  17.284053 10.04153 20.905316
H  17.284053 11.852161 22.715947
H  19.094684 10.04153 22.715947
H  19.094684 11.852161 20.905316
H  19.094684 11.852161 24.526577
H  17.284053 13.662791 13.662791
H  17.284053 15.473423 15.473423
H  19.094684 13.662791 15.473423
H  19.094684 15.473423 13.662791
H  17.284053 13.662791 17.284053
H  17.284053 15.473423 19.094684
H  13.662791 26.337209 15.473423
H  15.473423 24.526577 15.473423
H  15.473423 26.337209 13.662791
H  13.662791 24.526577 17.284053
H  13.662791 26.337209 19.094684
H  15.473423 24.526577 19.094684
H  15.473423 26.337209 17.284053
H  13.662791 24.526577 20.905316
H  13.662791 26.337209 22.715947
H  15.473423 24.526577 22.715947
H  15.473423 26.337209 20.905316
H  13.662791 24.526577 24.526577
H  15.473423 24.526577 26.337209
H  15.473423 26.337209 24.526577
H  13.662791 24.526577 13.662791
H  15.473423 24.526577 11.852161
H  15.473423 20.905316 11.852161
H  13.662791 22.715947 15.473423
H  15.473423 20.905316 15.473423
H  15.473423 22.715947 13.662791
H  13.662791 20.905316 17.284053
H  13.662791 22.715947 19.094684
H  15.473423 20.905316 19.094684
H  15.473423 22.715947 17.284053
H  13.662791 20.905316 20.905316
H  13.662791 22.715947 22.715947
H  15.473423 20.905316 22.715947
H  15.473423 22.715947 20.905316
H  13.662791 20.905316 24.526577
H  13.662791 22.715947 26.337209
H  15.473423 22.715947 24.526577
H  15.473423 20.905316 26.337209
H  15.473423 22.715947 28.147839
H  15.473423 28.147839 15.473423
H  15.473423 28.147839 19.094684
H  15.473423 28.147839 22.715947
H  31.769102 24.526577 20.905316
H  31.769102 15.473423 19.094684
H  31.769102 20.905316 17.284053
H  31.769102 22.715947 19.094684
H  31.769102 20.905316 20.905316
H  31.769102 22.715947 22.715947
H  31.769102 20.905316 24.526577
H  31.769102 19.094684 22.715947
H  31.769102 19.094684 15.473423
H  31.769102 17.284053 17.284053
H  31.769102 19.094684 19.094684
H  31.769102 17.284053 20.905316
H  26.337209 11.852161 17.284053
H  24.526577 10.04153 20.905316
H  26.337209 10.04153 22.715947
H  26.337209 11.852161 20.905316
H  24.526577 10.04153 24.526577
H  24.526577 11.852161 26.337209
H  26.337209 11.852161 24.526577
H  26.337209 10.04153 19.094684
H  26.337209 11.852161 13.662791
H  24.526577 11.852161 11.852161
H  24.526577 10.04153 13.662791
H  26.337209 10.04153 15.473423
H  24.526577 10.04153 17.284053
H  24.526577 8.230898 19.094684
H  24.526577 19.094684 8.230898
H  24.526577 17.284053 10.04153
H  26.337209 19.094684 10.04153
H  24.526577 19.094684 29.95847
H  26.337209 17.284053 29.95847
H  26.337209 19.094684 28.147839
H  26.337209 15.473423 28.147839
H  24.526577 15.473423 29.95847
H  24.526577 13.662791 10.04153
H  26.337209 13.662791 11.852161
H  26.337209 15.473423 10.04153
H  26.337209 13.662791 26.337209
H  24.526577 13.662791 28.147839
H  20.905316 8.230898 15.473423
H  20.905316 8.230898 19.094684
H  22.715947 8.230898 17.284053
H  20.905316 8.230898 22.715947
H  22.715947 8.230898 20.905316
H  20.905316 31.769102 20.905316
H  22.715947 31.769102 22.715947
H  20.905316 31.769102 24.526577
H  22.715947 31.769102 19.094684
H  20.905316 31.769102 17.284053
H  20.905316 26.337209 29.95847
H  22.715947 24.526577 29.95847
H  22.715947 26.337209 28.147839
H  20.905316 24.526577 31.769102
H  22.715947 28.147839 11.852161
H  20.905316 28.147839 13.662791
H  20.905316 29.95847 15.473423
H  22.715947 29.95847 13.662791
H  22.715947 29.95847 17.284053
H  20.905316 29.95847 26.337209
H  22.715947 28.147839 26.337209
H  22.715947 29.95847 24.526577
H  20.905316 28.147839 28.147839
H  20.905316 13.662791 28.147839
H  20.905316 15.473423 29.95847
H  22.715947 13.662791 29.95847
H  22.715947 15.473423 10.04153
H  20.905316 15.473423 8.230898
H  20.905316 13.662791 10.04153
H  22.715947 13.662791 11.852161
H  20.905316 11.852161 11.852161
H  20.905316 10.04153 13.662791
H  22.715947 10.04153 15.473423
H  22.715947 11.852161 13.662791
H  22.715947 10.04153 22.715947
H  20.905316 10.04153 24.526577
H  20.905316 11.852161 26.337209
H  22.715947 10.04153 26.337209
H  22.715947 11.852161 28.147839
H  22.715947 22.715947 31.769102
H  22.715947 22.715947 10.04153
H  20.905316 20.905316 31.769102
H  20.905316 24.526577 10.04153
H  20.905316 26.337209 11.852161
H  22.715947 26.337209 10.04153
H  22.715947 20.905316 8.230898
H  22.715947 17.284053 29.95847
H  20.905316 17.284053 31.769102
H  22.715947 19.094684 31.769102
H  20.905316 19.094684 8.230898
H  22.715947 17.284053 8.230898
H  20.905316 22.715947 8.230898
H  29.95847 22.715947 17.284053
H  28.147839 22.715947 26.337209
H  29.95847 20.905316 26.337209
H  29.95847 22.715947 24.526577
H  28.147839 20.905316 28.147839
H  29.95847 22.715947 13.662791
H  28.147839 22.715947 11.852161
H  28.147839 20.905316 13.662791
H  29.95847 20.905316 15.473423
H  29.95847 13.662791 22.715947
H  29.95847 15.473423 20.905316
H  28.147839 13.662791 24.526577
H  28.147839 15.473423 26.337209
H  29.95847 15.473423 24.526577
H  28.147839 19.094684 11.852161
H  28.147839 17.284053 13.662791
H  29.95847 17.284053 15.473423
H  29.95847 19.094684 13.662791
H  29.95847 17.284053 22.715947
H  28.147839 19.094684 26.337209
H  29.95847 17.284053 26.337209
H  29.95847 19.094684 24.526577
H  28.147839 17.284053 28.147839
H  28.147839 28.147839 17.284053
H  28.147839 28.147839 20.905316
H  28.147839 28.147839 24.526577
H  29.95847 26.337209 24.526577
H  28.147839 24.526577 13.662791
H  28.147839 26.337209 15.473423
H  29.95847 24.526577 15.473423
H  28.147839 26.337209 19.094684
H  29.95847 24.526577 19.094684
H  29.95847 26.337209 17.284053
H  28.147839 26.337209 22.715947
H  29.95847 26.337209 20.905316
H  28.147839 26.337209 26.337209
H  29.95847 24.526577 26.337209
H  28.147839 24.526577 28.147839
H  28.147839 13.662791 20.905316
H  29.95847 13.662791 19.094684
H  29.95847 15.473423 17.284053
H  28.147839 11.852161 15.473423
H  28.147839 11.852161 19.094684
H  28.147839 15.473423 11.852161
H  28.147839 13.662791 13.662791
H  29.95847 13.662791 15.473423
H  29.95847 15.473423 13.662791
H  28.147839 13.662791 17.284053
H  26.337209 26.337209 13.662791
H  24.526577 26.337209 29.95847
H  26.337209 24.526577 29.95847
H  24.526577 26.337209 11.852161
H  24.526577 24.526577 10.04153
H  26.337209 24.526577 11.852161
H  24.526577 20.905316 10.04153
H  26.337209 20.905316 11.852161
H  26.337209 22.715947 10.04153
H  24.526577 22.715947 29.95847
H  26.337209 20.905316 29.95847
H  26.337209 22.715947 28.147839
H  24.526577 20.905316 31.769102
H  24.526577 31.769102 20.905316
H  24.526577 29.95847 26.337209
H  26.337209 28.147839 26.337209
H  26.337209 29.95847 24.526577
H  24.526577 28.147839 28.147839
H  26.337209 29.95847 20.905316
H  24.526577 29.95847 22.715947
H  24.526577 28.147839 13.662791
H  24.526577 29.95847 15.473423
H  26.337209 28.147839 15.473423
H  24.526577 29.95847 19.094684
H  26.337209 28.147839 19.094684
H  26.337209 29.95847 17.284053
H  26.337209 28.147839 22.715947
H  13.662791 10.04153 20.905316
H  13.662791 11.852161 22.715947
H  15.473423 10.04153 22.715947
H  13.662791 10.04153 24.526577
H  13.662791 11.852161 26.337209
H  15.473423 10.04153 26.337209
H  15.473423 11.852161 28.147839
H  15.473423 10.04153 19.094684
H  13.662791 11.852161 19.094684
H  15.473423 11.852161 13.662791
H  13.662791 11.852161 15.473423
H  15.473423 10.04153 15.473423
H  13.662791 10.04153 17.284053
H  15.473423 8.230898 20.905316
H  13.662791 17.284053 10.04153
H  13.662791 19.094684 11.852161
H  15.473423 19.094684 10.04153
H  13.662791 17.284053 28.147839
H  13.662791 19.094684 29.95847
H  15.473423 17.284053 29.95847
H  15.473423 19.094684 31.769102
H  15.473423 13.662791 29.95847
H  13.662791 15.473423 29.95847
H  13.662791 15.473423 11.852161
H  15.473423 13.662791 11.852161
H  15.473423 15.473423 10.04153
H  13.662791 13.662791 13.662791
H  13.662791 13.662791 28.147839
H  11.852161 26.337209 20.905316
H  10.04153 24.526577 24.526577
H  11.852161 24.526577 26.337209
H  11.852161 26.337209 24.526577
H  11.852161 28.147839 15.473423
H  11.852161 28.147839 19.094684
H  11.852161 28.147839 22.715947
H  10.04153 26.337209 22.715947
H  10.04153 24.526577 20.905316
H  10.04153 15.473423 15.473423
H  11.852161 13.662791 15.473423
H  11.852161 15.473423 13.662791
H  10.04153 13.662791 17.284053
H  10.04153 15.473423 19.094684
H  11.852161 13.662791 19.094684
H  10.04153 13.662791 20.905316
H  10.04153 15.473423 22.715947
H  11.852161 13.662791 22.715947
H  10.04153 13.662791 24.526577
H  10.04153 15.473423 26.337209
H  11.852161 13.662791 26.337209
H  11.852161 15.473423 28.147839
H  11.852161 11.852161 17.284053
H  11.852161 11.852161 20.905316
H  11.852161 11.852161 24.526577
H  11.852161 26.337209 17.284053
H  11.852161 20.905316 11.852161
H  10.04153 20.905316 13.662791
H  10.04153 22.715947 15.473423
H  11.852161 22.715947 13.662791
H  10.04153 22.715947 22.715947
H  10.04153 20.905316 24.526577
H  10.04153 22.715947 26.337209
H  11.852161 20.905316 26.337209
H  11.852161 22.715947 28.147839
H  11.852161 24.526577 11.852161
H  10.04153 24.526577 13.662791
H  10.04153 26.337209 15.473423
H  11.852161 26.337209 13.662791
H  10.04153 24.526577 17.284053
H  10.04153 26.337209 19.094684
H  10.04153 19.094684 26.337209
H  11.852161 17.284053 26.337209
H  11.852161 19.094684 28.147839
H  10.04153 17.284053 24.526577
H  10.04153 17.284053 13.662791
H  10.04153 19.094684 15.473423
H  11.852161 19.094684 13.662791
H  10.04153 17.284053 17.284053
H  19.094684 19.094684 31.769102
H  17.284053 22.715947 29.95847
H  17.284053 20.905316 31.769102
H  19.094684 22.715947 31.769102
H  17.284053 22.715947 8.230898
H  19.094684 20.905316 8.230898
H  17.284053 17.284053 31.769102
H  17.284053 13.662791 28.147839
H  17.284053 15.473423 29.95847
H  19.094684 13.662791 29.95847
H  19.094684 15.473423 31.769102
H  17.284053 17.284053 10.04153
H  19.094684 17.284053 8.230898
H  17.284053 19.094684 8.230898
H  19.094684 28.147839 11.852161
H  17.284053 28.147839 13.662791
H  17.284053 29.95847 15.473423
H  19.094684 29.95847 13.662791
H  17.284053 29.95847 22.715947
H  17.284053 29.95847 26.337209
H  19.094684 28.147839 26.337209
H  19.094684 29.95847 24.526577
H  17.284053 28.147839 28.147839
H  19.094684 26.337209 28.147839
H  19.094684 24.526577 29.95847
H  17.284053 26.337209 29.95847
H  19.094684 24.526577 8.230898
H  17.284053 24.526577 10.04153
H  17.284053 26.337209 11.852161
H  19.094684 26.337209 10.04153
H  17.284053 10.04153 13.662791
H  19.094684 10.04153 15.473423
H  17.284053 10.04153 17.284053
H  17.284053 10.04153 24.526577
H  17.284053 11.852161 26.337209
H  19.094684 10.04153 26.337209
H  19.094684 11.852161 28.147839
H  17.284053 11.852161 11.852161
H  17.284053 13.662791 10.04153
H  19.094684 13.662791 11.852161
H  19.094684 15.473423 10.04153
H  19.094684 8.230898 24.526577
H  19.094684 8.230898 20.905316
H  17.284053 8.230898 19.094684
H  19.094684 8.230898 17.284053
H  19.094684 31.769102 15.473423
H  17.284053 31.769102 17.284053
H  19.094684 31.769102 19.094684
H  17.284053 31.769102 20.905316
H  19.094684 31.769102 22.715947
H  13.662791 26.337209 26.337209
H  13.662791 24.526577 28.147839
H  15.473423 24.526577 29.95847
H  15.473423 26.337209 28.147839
H  15.473423 26.337209 10.04153
H  13.662791 26.337209 11.852161
H  13.662791 24.526577 10.04153
H  15.473423 20.905316 8.230898
H  13.662791 20.905316 10.04153
H  13.662791 22.715947 11.852161
H  15.473423 22.715947 10.04153
H  13.662791 20.905316 28.147839
H  13.662791 22.715947 29.95847
H  15.473423 20.905316 29.95847
H  15.473423 31.769102 19.094684
H  15.473423 28.147839 26.337209
H  15.473423 29.95847 24.526577
H  13.662791 28.147839 24.526577
H  15.473423 29.95847 20.905316
H  13.662791 29.95847 22.715947
H  15.473423 28.147839 11.852161
H  13.662791 28.147839 13.662791
H  13.662791 29.95847 15.473423
H  15.473423 29.95847 13.662791
H  13.662791 28.147839 17.284053
H  13.662791 29.95847 19.094684
H  15.473423 29.95847 17.284053
H  13.662791 28.147839 20.905316
H  8.230898 22.715947 17.284053
H  8.230898 20.905316 22.715947
H  8.230898 22.715947 20.905316
H  8.230898 20.905316 19.094684
H  8.230898 20.905316 15.473423
H  8.230898 15.473423 20.905316
H  8.230898 17.284053 19.094684
H  8.230898 19.094684 17.284053
H  8.230898 17.284053 22.715947
H  8.230898 19.094684 20.905316
H  8.230898 19.094684 24.526577
initenergy: -2501.04767874978
energy: -2515.652192899
