title: Memory allocated for RI-J 666 MByte
elementType: c
basis: def2-SV(P)
elementType: n
elementType: h
elementType: o
method: dft
functional: b-p
elementType: c n h o
basis: def2-SV(P) def2-SV(P) def2-SV(P) def2-SV(P)
energy: -6669.413204460 hartree
formula: C145H111N17O2
InChI: InChI=1/C132H100N12.C13H11N5O2/c1-125-97-41-33-89(34-42-97)13-9-85-17-25-93(26-18-85)81-133-105-57-49-101(50-58-105)129(5)117-73-75-119(141-117)130(6)102-51-59-106(60-52-102)134-82-94-27-19-86(20-28-94)10-14-90-35-43-98(44-36-90)126(2,111-67-65-109(125)137-111)113-69-71-115(139-113)128(4)100-47-39-92(40-48-100)16-12-88-23-31-96(32-24-88)84-136-108-63-55-104(56-64-108)132(8,123-79-77-121(130)143-123)124-80-78-122(144-124)131(7,120-76-74-118(129)142-120)103-53-61-107(62-54-103)135-83-95-29-21-87(22-30-95)11-15-91-37-45-99(46-38-91)127(3,112-68-66-110(125)138-112)114-70-72-116(128)140-114;19-17-5-1-11(2-6-17)9-16-10-13(14-15-16)12-3-7-18(20)8-4-12/h17-84,137-144H,1-8H3;1-8,10H,9H2
275 atoms
C  -12.64252065 1.76384065 -6.12785427
C  -13.50166739 2.77712393 -6.5474623
C  -12.90004454 3.40938966 -7.68044469
C  -11.68566847 2.7701184 -7.92851283
N  -11.55441306 1.76447656 -6.98383171
C  -12.73928715 0.78739635 -4.96997824
H  -14.46386202 3.03477098 -6.09073099
H  -13.31256653 4.24709603 -8.25345561
C  -10.59920181 3.08499038 -8.93663924
C  -10.3591732 1.92613011 -9.88668857
C  -10.4613829 1.86229999 -11.27608838
C  -9.9418362 0.59731092 -11.69331314
C  -9.53134577 -0.08676062 -10.55005004
N  -9.80943458 0.72539596 -9.46383555
H  -10.85897957 2.64923017 -11.92660609
H  -9.88056082 0.22557581 -12.72238969
C  -13.09597097 -0.59352261 -5.48654018
C  -14.30989524 -1.27916979 -5.48027387
C  -14.0975286 -2.54018933 -6.11952998
C  -12.75827591 -2.60149801 -6.50405305
N  -12.17245494 -1.40232892 -6.1275774
H  -15.25534554 -0.91037743 -5.06668131
H  -14.84472775 -3.32698503 -6.27212977
C  -9.94431262 -2.44586855 -9.89941386
C  -10.6389926 -3.44474631 -10.57900881
C  -11.52301294 -4.06672311 -9.64338814
C  -11.35036359 -3.43671856 -8.41108719
N  -10.39741867 -2.44600331 -8.59106598
C  -8.90094919 -1.45725504 -10.38395014
H  -10.53125218 -3.69756067 -11.63990445
C  -11.94600434 -3.7587932 -7.05468106
C  -13.84143746 1.26299126 -3.99221815
C  -11.00863419 4.33519634 -9.75158419
C  -8.34626416 -1.93023055 -11.75018628
C  -9.26319494 3.94633814 -6.9054972
C  -9.27713882 3.41822304 -8.2122829
C  -8.0447328 3.24384389 -8.87871944
C  -6.83220557 3.49283595 -8.23372838
C  -6.81797426 3.92793736 -6.88347187
C  -8.05284847 4.21455905 -6.25433463
H  -10.22075705 4.13817793 -6.396529
H  -8.05289273 2.89751318 -9.92534373
H  -5.88533705 3.35427782 -8.77925087
H  -8.03160683 4.59802696 -5.22224193
C  -11.03283662 -3.92487092 -4.66648679
C  -10.82468702 -4.10162454 -6.0511622
C  -9.59524858 -4.64049806 -6.47968082
C  -8.57274371 -4.90978422 -5.56207305
C  -8.74194417 -4.61756725 -4.18779198
C  -10.01551824 -4.17939845 -3.74367845
H  -12.01700426 -3.57014094 -4.31822605
H  -9.44290093 -4.83884016 -7.55277448
H  -7.59506979 -5.29584876 -5.89073737
N  -7.60779181 -4.71002173 -3.3780037
H  -10.20366233 -4.03216679 -2.66811312
N  -5.66257391 4.04556674 -6.10776573
C  -4.63089999 3.30957877 -6.36350315
C  -7.48455063 -3.92773131 -2.35502409
C  -3.93153243 -4.44688605 -1.22092977
C  -5.13221547 -4.63535557 -1.89345594
C  -6.26388418 -3.84979937 -1.56666054
C  -6.16539064 -2.88959336 -0.5349402
C  -4.96794508 -2.69941725 0.15077138
C  -3.8289183 -3.46948626 -0.1917268
H  -3.03964935 -5.03491005 -1.48646943
H  -5.22567516 -5.36503765 -2.71237752
H  -7.04366741 -2.27098666 -0.28960661
H  -4.88635635 -1.93661991 0.93882521
C  -2.33660075 2.50213562 -5.85257445
C  -3.42537952 3.34838913 -5.54254971
C  -3.34339665 4.18785696 -4.40283664
C  -2.2094573 4.16961736 -3.59541706
C  -1.11159579 3.31500265 -3.90680158
C  -1.1919265 2.4827132 -5.05465691
H  -2.39975355 1.84023658 -6.73004808
H  -4.20121747 4.84027889 -4.17617429
H  -2.14435589 4.81525592 -2.705801
C  0.00351669 3.25261795 -3.03279378
H  -0.3569948 1.80893992 -5.3010783
C  -2.59457778 -3.2739885 0.47394895
C  -10.93405092 -0.38061569 -3.54710054
C  -11.41051409 0.77736205 -4.19053355
C  -10.66615274 1.96945606 -4.06280924
C  -9.48069911 2.00539452 -3.32731781
C  -9.0298707 0.85124662 -2.64676211
C  -9.76065131 -0.35072931 -2.78540319
H  -11.4871628 -1.32528714 -3.64751819
H  -11.03248391 2.88295513 -4.55569086
H  -8.89635214 2.93323982 -3.22934436
H  -9.38657592 -1.27272724 -2.31238957
C  -7.32587454 -2.52975173 -8.66457997
C  -7.71037123 -1.39479193 -9.40847662
C  -6.93529048 -0.22447241 -9.28869267
C  -5.80377753 -0.18864992 -8.46916931
C  -5.40967833 -1.33593403 -7.74265196
C  -6.21055216 -2.49822457 -7.82327552
H  -7.918645 -3.45328025 -8.74839345
H  -7.22714693 0.67582553 -9.84814789
H  -5.22433728 0.74344384 -8.37146927
N  -4.25472879 -1.38599633 -6.96181513
H  -5.91138224 -3.38198756 -7.23899608
N  -7.8884704 0.96658779 -1.8529664
C  -7.8688392 0.40023223 -0.69313207
C  -3.17051847 -0.83966034 -7.40096914
C  0.48615321 -0.47861906 -6.54042562
C  -0.72976276 -0.37616054 -7.21990789
C  -1.9185383 -0.88848322 -6.65157965
C  -1.87277856 -1.49306878 -5.37287934
C  -0.66646626 -1.60460681 -4.69015487
C  0.53792946 -1.10855234 -5.26958621
H  1.41542601 -0.09438452 -6.98850873
H  -0.76326796 0.09434895 -8.21740097
H  -2.80520929 -1.89268517 -4.94700532
H  -0.63640955 -2.08630471 -3.70036531
C  -6.77772792 -0.01927217 1.50743597
C  -6.71893833 0.50844172 0.19803991
C  -5.54998657 1.18217543 -0.22755847
C  -4.4721912 1.33302472 0.6353373
C  -4.5278847 0.80612752 1.95783298
C  -5.69665124 0.12050777 2.37955583
H  -7.68882857 -0.54396272 1.84132378
H  -5.53420304 1.58818685 -1.24921379
H  -3.56598244 1.8698218 0.31298988
C  -3.41687738 0.96958669 2.82056989
H  -5.73934735 -0.28984428 3.39981613
C  1.75552167 -1.25797897 -4.55881564
C  6.78840024 -0.20795546 0.9522878
C  7.94369386 0.56763083 1.0368007
C  7.54911659 1.90751662 1.34376204
C  6.15928709 1.925347 1.43966237
N  5.71701845 0.63130089 1.22013334
C  6.59074424 -1.63745603 0.48172613
H  8.96777191 0.21180167 0.87754964
H  8.21394995 2.76827107 1.47778021
C  5.19151718 3.06572457 1.69823002
C  4.73947201 3.04677165 3.14429828
C  5.02510428 3.92535308 4.18854342
C  4.41173363 3.40732141 5.37043705
C  3.76260859 2.22240406 5.02708073
N  3.98034925 2.01498 3.67364038
H  5.626655 4.8380875 4.11617773
H  4.44220099 3.85685603 6.36901163
C  6.10296416 -2.54013773 1.59542736
C  6.65523487 -3.71377581 2.10758568
C  5.75626876 -4.22468454 3.09405342
C  4.67153513 -3.35332899 3.16598778
N  4.90234584 -2.33281425 2.25811762
H  7.60972554 -4.15963797 1.80654425
H  5.89661628 -5.12842703 3.69732229
C  3.34967116 -0.11827808 5.8532319
C  3.84638251 -0.91065236 6.88733428
C  3.9660311 -2.24678011 6.39262314
C  3.53672663 -2.24519428 5.06667324
N  3.18977703 -0.94288767 4.7488841
C  2.86935263 1.32214885 5.85536667
H  4.08718578 -0.56767727 7.89986074
C  3.44266978 -3.37117553 4.05178659
C  7.93382624 -2.18584889 -0.05964108
C  5.9063149 4.41193016 1.41723359
C  2.83046808 1.84735684 7.3105071
C  4.27318231 2.67401341 -0.64624386
C  4.013541 2.97769391 0.70838643
C  2.69281032 3.28937894 1.08369364
C  1.66527581 3.33162819 0.13563445
C  1.93693712 3.06252601 -1.22950696
C  3.25960218 2.71254942 -1.60398322
H  5.30098659 2.41878313 -0.94808202
H  2.47311313 3.51990395 2.13610341
H  0.63828271 3.58687215 0.43986511
H  3.47639238 2.48626291 -2.65914102
C  2.11089762 -3.61782653 1.86546606
C  2.15241223 -3.24017568 3.22214017
C  0.95740344 -2.80811425 3.83443067
C  -0.24103414 -2.75565843 3.12035369
C  -0.28364603 -3.14907097 1.75797809
C  0.91919315 -3.57021971 1.13687018
H  3.03274974 -3.97070196 1.37975238
H  0.97218411 -2.51454894 4.89505067
H  -1.17014155 -2.42205724 3.6071898
C  -1.51305629 -3.17115347 1.05223449
H  0.89841606 -3.8736501 0.07870586
C  0.90596676 3.15188933 -2.20012659
C  4.66245746 -2.66445311 -0.88936489
C  5.59724078 -1.62807954 -0.69874872
C  5.6466521 -0.57900118 -1.64229556
C  4.75755022 -0.5335957 -2.71718641
C  3.77027997 -1.54154537 -2.86785735
C  3.75402281 -2.62470407 -1.95190512
H  4.6466457 -3.50864241 -0.18247053
H  6.39327885 0.22051869 -1.50970424
H  4.79007483 0.29945793 -3.43635008
H  3.00033203 -3.41818034 -2.07346384
C  0.52991464 0.31913899 5.66297043
C  1.42833355 1.34784469 5.30784148
C  0.97722712 2.37816911 4.45972775
C  -0.30456773 2.3389907 3.90390402
C  -1.18039413 1.2644078 4.20389047
C  -0.75861055 0.27461424 5.12993027
H  0.86962724 -0.4722032 6.35103733
H  1.65439893 3.21430017 4.22701606
H  -0.63715498 3.12431068 3.20729318
C  -2.40903283 1.12936584 3.50912688
H  -1.44673731 -0.54387071 5.39235129
C  2.73965854 -1.41296414 -3.83486547
C  3.37308783 -4.72697951 4.79708115
H  -10.71686714 1.18047449 -6.83352326
H  -9.51693605 0.49971538 -8.49997868
H  -11.16669605 -1.17972896 -6.18368651
H  -9.9757577 -1.8689307 -7.84676743
H  -13.59325336 2.27124601 -3.59998886
H  -13.9227241 0.55593591 -3.14086952
H  -10.21186659 4.59375144 -10.4788582
H  -11.15857173 5.1999506 -9.07281897
H  -7.58116042 -1.21481395 -12.11727935
H  -7.88099787 -2.93246316 -11.64518444
H  4.72256354 0.37005104 1.16666914
H  3.53576805 1.27865824 3.10762959
H  4.2059832 -1.6072763 2.03456172
H  4.33304462 -3.11704243 6.94852298
H  2.73329562 -0.67719955 3.86224979
H  7.79392901 -3.21360465 -0.45323241
H  8.30677749 -1.54206938 -0.88285636
H  5.20635318 5.25655896 1.58481287
H  6.2626081 4.4450359 0.36709883
H  2.42306856 2.87908771 7.33265329
H  2.18071139 1.19928356 7.93367573
H  3.29661153 -5.55879149 4.06626539
H  2.48430107 -4.75119463 5.46103035
C  -12.85460774 -5.00437164 -7.18309648
H  -12.26577091 -5.86741264 -7.55702213
H  -12.2114265 -4.89366516 -9.85018654
H  -13.2767083 -5.2730468 -6.19259482
H  -14.82656784 1.3171014 -4.50113886
H  -11.95210134 4.1488243 -10.30705538
H  -9.15690141 -1.99754221 -12.506116
H  8.69799879 -2.21424824 0.74542987
H  6.78047197 4.53872015 2.08913989
H  3.85001038 1.85720504 7.75042908
H  4.27972347 -4.88511063 5.41763154
H  -13.69109133 -4.81013751 -7.88720407
H  -4.6281034 2.55417132 -7.18696269
H  -8.27635096 -3.18660297 -2.08209564
H  -8.75722683 -0.15011054 -0.29649899
H  -3.12583529 -0.35631555 -8.40880511
N  -8.210013 -0.34479403 -5.84395832
C  -7.73986944 -1.50434508 -5.28117838
C  -6.58766462 -1.52184036 -4.49620879
C  -5.85920622 -0.33963337 -4.2220917
C  -6.38489317 0.84153289 -4.79755712
C  -7.5275823 0.81845474 -5.5962902
O  -9.28813557 -0.34587588 -6.60166878
H  -8.3255435 -2.40171192 -5.51877309
H  -6.23650304 -2.48532519 -4.10304969
H  -5.91732635 1.82062375 -4.6239557
H  -7.96371787 1.7137129 -6.05676691
C  -4.62570564 -0.3715877 -3.41114069
C  -3.72082673 0.63877804 -3.0578073
N  -2.74150568 0.00411723 -2.33611627
N  -2.9999247 -1.32956178 -2.26287271
N  -4.12925158 -1.54894581 -2.88463696
C  -1.43011957 0.60967049 -2.02365037
H  -1.652288 1.67439972 -1.80342628
H  -0.86238982 0.60791648 -2.9768855
O  2.6291415 -0.16578039 1.83101184
N  1.64347772 -0.1292648 0.96743712
C  0.33233903 -0.0221889 1.37299539
H  0.19074166 -0.01583728 2.46082969
C  -0.71861052 0.0980455 0.45617806
H  -1.73208284 0.20412964 0.87191776
C  -0.47654992 0.11293954 -0.93705897
C  0.87307004 -0.0687332 -1.31329119
H  1.16501897 -0.07568926 -2.3735941
C  1.89857484 -0.18791443 -0.37652223
H  2.9583216 -0.28160936 -0.64469191
H  -3.68062083 1.71327786 -3.27103486
converged: yes
orbitalenergy: -4.9296 -4.7810 -4.6312 -4.5204 -4.2349 -3.5166 -3.3546 -3.3255 -3.0734 -2.9941 electronvolt
charge: -0.000000
dipole: -6956.794870 6958.905980 2.111111 -455.403808 456.803116 1.399308 -5249.681978 5250.439039 0.757061
quadrupole: 194849.088497 -195633.666818 -784.578321 26390.087013 -27102.473527 -712.386514 113436.669340 -114161.837976 -725.168636 6409.154824 -6417.415568 -8.260744 116053.179822 -116127.143561 -73.963740 1485.451410 -1496.030370 -10.578960
