program: Orca
programVersion: 6.1.x
elementType: P Au C H H H C H H H C H H H C C H C H H N C H H H C H C O O C H H
elementType: Au
charge: 1
multiplicity: 1
keywords: tpssh d3bj def2-tzvppd def2/J defgrid3 verytightscf
formula: C10H18AuNO2P
InChI: InChI=1/C7H9NO2.C3H9P.Au/c1-3-4-6-7(9)10-5-8(6)2;1-4(2)3;/h5-6H,1,4H2,2H3;1-3H3;/rC10H18AuNO2P/c1-8(11-15(3,4)5)6-9-10(13)14-7-12(9)2/h7,9H,1,6H2,2-5H3
33 atoms
P  0.207273 0.08035 -2.920965
Au -0.451271 -0.174516 -0.672245
C  0.733485 1.788072 -3.343833
H  1.570503 2.079616 -2.703107
H  1.041789 1.840741 -4.393075
H  -0.097002 2.479185 -3.173595
C  -1.095622 -0.322139 -4.150694
H  -1.958921 0.33098 -3.995018
H  -0.712166 -0.183396 -5.166811
H  -1.412676 -1.360759 -4.020601
C  1.634483 -0.97405 -3.392975
H  1.374946 -2.026389 -3.246568
H  1.899589 -0.806655 -4.441978
H  2.491084 -0.732232 -2.757373
C  -0.99104 -0.394222 1.303985
C  -0.363517 -1.459422 2.13083
H  0.082234 -2.266018 1.546882
C  -1.677134 0.602648 2.00734
H  -2.091506 1.450462 1.466009
H  -2.202471 0.371844 2.937585
N  0.28739 0.267791 3.802079
C  -0.47716 -0.037117 5.002332
H  0.160175 -0.598708 5.687211
H  -0.776896 0.898828 5.476184
H  -1.370928 -0.631431 4.775725
C  0.853494 -0.741308 2.947566
H  1.456833 -1.487319 3.460156
C  1.629587 0.132194 1.970414
O  2.541866 -0.107955 1.236666
O  1.005549 1.379193 2.016385
C  -0.006093 1.28753 2.955076
H  -0.38564 2.236364 3.316288
H  -1.013952 -1.882244 2.905555
elementType: P Au C H N O
totalener: -1074.32683301956081 hartree
nucrepener: 1347.89611908344318 hartree
electener: -2422.13983106084106 hartree
oneelecener: -4183.19380079138955 hartree
twoeener: 1761.05396973054849 hartree
cpcmener: -0.08080021538392 hartree
kineticenergy: 980.24554071560976 hartree
exchangeener: -104.729843289913 hartree
energy: -2094.3500 -521.0571 -519.4029 -390.1002 -279.7822 -279.5872 -277.9303 -276.7516 -276.5551 -276.3536 -276.0981 -275.5328 -275.5267 -275.5199 -177.3841 -127.0116 -127.0112 -126.9685 -112.1188 -63.1018 -62.6698 -62.6184 -31.0936 -28.8336 -26.6418 -22.2027 -21.1590 -20.8174 -20.1599 -18.7908 -18.7845 -18.5889 -17.3952 -16.4747 -15.5076 -14.9039 -14.5669 -14.0649 -13.2781 -12.9786 -12.6757 -12.4112 -12.1079 -11.8746 -11.7466 -11.6172 -11.6131 -11.4099 -11.0308 -10.9810 -10.9150 -10.9058 -10.6884 -10.5270 -10.2439 -9.9724 -9.4660 -9.3944 -8.7820 -8.6503 -8.2448 -8.1039 -8.0794 -8.0742 -7.4537 -7.2319 -6.6904 -3.1303 -1.5771 -0.7821 -0.5157 -0.2006 -0.0394 0.1974 0.3073 0.5646 0.7200 0.9145 electronvolt
chargesum: 1.0000000
charge: 0.454819 -0.543516 -0.329592 0.126751 0.142316 0.115996 -0.355118 0.125585 0.137505 0.125327 -0.330108 0.119715 0.141650 0.127889 -0.477833 0.403361 0.028384 0.093460 0.072849 0.180501 -0.101839 -0.074386 0.056335 0.088951 0.105950 1.129999 -0.169652 -0.128360 -0.556490 -0.320908 0.642942 -0.134419 0.101936
charge: 0.747810 0.638551 -0.013745 -0.049799 -0.040795 -0.049777 -0.014609 -0.049806 -0.040943 -0.049784 -0.013147 -0.049587 -0.040792 -0.050219 -0.293783 0.037285 0.014128 0.097895 -0.014187 -0.001389 -0.010177 0.228920 0.023428 0.025528 0.011175 -0.010176 0.080084 -0.398214 0.130505 0.084494 -0.040056 0.086251 0.024930
qa: 0.4548 -0.5435 -0.3296 0.1268 0.1423 0.1160 -0.3551 0.1256 0.1375 0.1253 -0.3301 0.1197 0.1417 0.1279 -0.4778 0.4034 0.0284 0.0935 0.0728 0.1805 -0.1018 -0.0744 0.0563 0.0890 0.1060 1.1300 -0.1697 -0.1284 -0.5565 -0.3209 0.6429 -0.1344 0.1019
va: 4.1085 1.5872 4.1275 1.0809 1.0795 1.0861 4.1453 1.0710 1.0823 1.0730 4.1277 1.0825 1.0816 1.0823 3.4678 3.6767 1.0439 3.7295 1.0725 0.9994 3.1811 4.0421 1.0191 0.9785 0.9704 3.5260 0.8989 3.3952 1.6737 1.7713 3.7369 0.8971 0.9321
dispersion: -0.051103361 hartree
energy: -1074.377936380178 hartree
dipole: 59.000955821 -59.992332696 -0.991376875 22.773555190 -22.671975908 0.101579281 91.378360980 -88.867581683 2.510779297
dipolemethod: SCF
magnitude: 2.701325441 au
magnitude: 6.866223603 debye
