program: Gaussian 16
title: opt freq
version: ES64L-G16RevA.03
frameworkgroup: C1[X(C27H32Cs2O4)]
method: RM06
basis: GenECP
operation: Freq
keyword: #pFREQ
keyword: genecp
keyword: SCRFDef=AsymmetricIEFPCM
keyword: scrf=(smd,solvent=mesitylene)
keyword: m06scf=xqc
keyword: temperature=403.15
title: #p FREQ genecp SCRFDef=AsymmetricIEFPCM scrf=(smd,solvent=mesitylene)
basis: NPDir=0 NMtPBC= 1 NCelOv= 1 NCel= 1 NClECP= 1 NCelD= 1
basis: NCelK= 1 NCelE2= 1 NClLst= 1 CellRange= 0.0.
basis: One-electron integrals computed using PRISM.
basis: One-electron integral symmetry used in STVInt
converged: YES YES NO NO
title: Mulliken charges:
elementType: O O C O Cs Cs H C H H H C C C C C C H H H C H H H C C C C C C H H C H H H C H H H C H H H C H H H C O C C C C C C H H H H H C H H H
charge: -0.676113 -0.667575 0.619626 -0.626904 0.826853 0.786408 0.145794 -0.611705 0.200777 0.184735 0.176655 0.179967 -0.284121 0.182930 -0.280407 0.152037 -0.295649 0.151250 0.163814 0.197288 -0.610992 0.194769 0.158829 0.215634 0.127242 -0.297263 0.179497 -0.292861 0.161062 -0.265193 0.142797 0.143656 -0.612127 0.164104 0.151727 0.258205 -0.597318 0.193642 0.194843 0.158667 -0.614144 0.217791 0.188736 0.161533 -0.610169 0.178213 0.199441 0.176467 0.468105 -0.582166 0.040726 -0.157467 -0.207906 -0.191426 -0.188714 -0.179186 0.188013 0.164794 0.176108 0.172032 0.173329 -0.735585 0.123398 0.383719 0.159778
chargesum: -0.00000
title: Mulliken charges with hydrogens summed into heavy atoms:
elementType: O O C O Cs Cs C C C C C C C C C C C C C C C C C C C O C C C C C C C
charge: -0.292394 -0.667575 0.619626 -0.626904 0.826853 0.786408 -0.049538 0.179967 -0.132871 0.182930 -0.116593 0.152037 -0.149855 -0.041761 0.127242 -0.154466 0.179497 -0.149206 0.161062 -0.067905 -0.038091 -0.050166 -0.046085 -0.056048 0.468105 -0.582166 0.040726 0.030547 -0.043112 -0.015318 -0.016682 -0.005857 -0.452409
chargesum: 0.00000
polarizability: 4.42678152e+02 8.80020854e+00 3.34555304e+02 2.24532989e+01 1.88623629e+01 3.28806248e+02
1716.lowfreq: -1529.7765 -13.4475 -6.7262 -0.0006 0.0001 0.0007 3.0956 13.8625 16.1185
frequency: -1529.7764 3.7201 15.0105 21.1287 29.7430 31.8163 34.6427 38.0418 41.7598 47.5694 51.3523 53.1258 56.3205 62.2636 64.1882 73.6846 76.6577 81.3708 82.2144 85.8597 97.4792 99.9939 119.1688 138.9649 143.8967 153.7868 171.6824 185.3139 187.3832 192.3190 198.1301 198.2740 201.4076 231.5279 238.8265 239.3850 243.5095 257.0707 266.0152 275.0720 276.4531 284.1332 298.3954 366.2663 400.3043 421.8722 456.5525 462.4246 464.4921 513.3535 516.0434 517.4627 518.9855 520.0772 526.3828 537.1256 538.9002 539.3340 570.2897 587.6275 588.8569 612.7204 623.1213 673.4353 694.0559 696.6703 699.6370 706.8807 709.7868 759.4976 788.3466 839.3709 851.8952 854.6211 875.4721 878.4455 888.7998 889.6119 920.2064 953.4276 955.1735 956.9354 958.7851 960.7212 969.8934 987.3479 997.6314 1004.1934 1011.3845 1012.0047 1029.5337 1030.7283 1038.5766 1041.1809 1050.0072 1050.3477 1050.5125 1053.0043 1053.2510 1054.3410 1059.7262 1067.2844 1076.4515 1079.6106 1082.2911 1099.2300 1125.7255 1157.2297 1179.0468 1189.2101 1190.1840 1192.5541 1204.4950 1297.5776 1308.7096 1312.9099 1330.9007 1339.7192 1345.4815 1372.9458 1375.5982 1376.6050 1409.8243 1414.4509 1417.0597 1418.1800 1421.9284 1428.5663 1431.6732 1452.5911 1459.7769 1462.3968 1463.6099 1470.5600 1472.6630 1474.9917 1475.7012 1477.0070 1477.1351 1478.5821 1479.4375 1481.8428 1488.3778 1500.0742 1513.4317 1514.1285 1518.8449 1522.4103 1523.7953 1527.4371 1645.5089 1652.7361 1669.1490 1669.2779 1670.7822 1672.1440 1673.2512 1732.8832 2983.7189 3009.5271 3010.3155 3020.2684 3026.5754 3028.6090 3071.8787 3081.6923 3083.5490 3087.7326 3097.0361 3097.6743 3100.2526 3111.3944 3113.0730 3115.7750 3116.7790 3119.6128 3124.8290 3126.9219 3136.7677 3136.8097 3139.8734 3144.5230 3147.4027 3149.9751 3159.7940 3168.7870 3178.3465 3185.7318 3209.7590
redmass: 1.1175 4.0596 6.1118 5.3962 4.3823 6.3718 4.3837 4.2619 6.0731 3.6947 4.3604 2.2092 1.5381 8.5245 1.0624 4.2606 8.6846 4.6817 3.0759 2.4379 4.9415 5.7889 7.3601 6.1095 5.2804 1.2488 6.1704 1.8201 8.5183 7.6731 2.9592 3.9593 1.5827 4.7705 3.0304 3.0395 2.7809 3.6754 1.2461 2.4507 2.4720 2.5028 1.9619 4.4158 3.8324 3.0821 5.1080 2.4621 2.4438 2.1282 4.6491 4.5593 5.1115 5.0687 3.3160 3.2531 3.2780 3.2271 1.4683 4.0489 4.0829 3.7266 6.2871 3.5218 8.4262 4.8563 2.6038 1.8466 2.9265 3.5310 2.3085 1.2592 1.2378 1.2586 1.3148 1.3050 1.8157 2.9373 1.4281 2.1504 2.2558 2.3889 2.4018 1.8146 1.3746 1.2652 1.5941 4.9857 5.3858 2.8554 1.4911 1.6118 1.8248 1.6445 1.5868 1.9436 1.6897 1.5548 1.5722 1.8475 1.5352 1.5243 3.7167 2.0342 1.5408 1.4622 2.4617 1.0792 1.1242 1.3562 1.3595 1.3649 1.3822 1.3031 1.3185 1.4589 2.4437 3.2656 3.1566 5.2068 7.5790 5.1116 1.2979 1.2357 1.2057 1.3189 1.1889 1.4619 1.4323 1.3064 1.5068 1.4014 1.4974 1.4436 2.0605 1.0983 1.0508 1.0656 1.1006 1.0968 1.3907 1.3232 1.0865 1.8299 1.4251 1.9700 1.5518 1.9868 1.4871 2.4958 6.4403 5.6508 6.4152 6.4237 6.2848 6.2609 6.0865 10.0710 1.0456 1.0452 1.0405 1.0373 1.0386 1.0385 1.0597 1.0922 1.0931 1.0986 1.1003 1.1004 1.1007 1.1030 1.1032 1.1027 1.1028 1.1028 1.1019 1.0946 1.0902 1.0901 1.0904 1.0905 1.1024 1.0943 1.0850 1.0891 1.0926 1.0980 1.0930
irintensity: 6712.8944 2.7527 2.3142 5.0496 0.2510 4.1469 0.4046 2.7899 2.8094 1.4790 4.0688 4.6357 3.3883 5.0765 1.4172 0.9055 4.8955 6.6677 13.3529 12.5827 0.0894 4.2104 0.4145 6.0204 7.0862 0.2433 1.7629 2.3677 20.1163 71.9350 9.0291 29.2282 3.6987 0.5669 0.3910 1.0949 10.8485 2.4745 0.2892 0.5097 0.7373 4.7059 6.7739 6.0864 3.1715 1.3403 3.5170 0.7117 0.2043 3.5578 0.6898 0.1417 0.4246 0.3572 1.4677 1.0377 3.2174 0.2827 0.5512 0.0150 0.0055 20.3399 0.6950 3.2609 6.2989 5.5644 13.0335 93.3797 2.5683 9.2736 28.4537 39.9114 30.4721 0.2367 1.1503 0.1682 25.8896 29.7196 19.1281 1.8269 1.0709 2.9063 1.9029 42.5360 0.2692 0.0869 10.6395 0.5442 0.6805 0.9698 1.6425 4.4226 4.2832 11.4125 3.4044 3.9015 3.6323 17.3521 10.6479 11.2994 5.6737 3.9363 9.3594 26.1115 33.9908 12.9466 5.0770 0.1498 2.4145 1.6034 0.7330 0.5550 0.8292 0.2694 0.5882 10.9971 140.9062 4.8396 4.2086 0.7756 3.2180 0.2427 12.9778 2.0353 20.3145 2.8156 23.5429 9.6560 3.3284 7.2878 39.0484 9.5485 13.4470 41.7267 1.3836 16.1278 19.6466 4.9590 11.5893 3.5680 28.6512 70.9954 4.1081 63.5198 51.6098 45.5375 114.3446 50.0042 19.1474 15.0241 39.5583 506.3501 35.9162 27.7704 16.5585 101.7467 31.8494 354.4149 169.9658 39.3926 35.1234 41.7831 47.9734 39.7299 20.2509 96.0968 20.2048 10.2388 11.2483 19.3206 15.2882 21.1391 26.3293 11.4607 22.3781 18.6823 15.1104 107.2596 31.4367 37.7723 15.9645 20.7748 30.3631 11.4563 0.6192 11.0276 26.7853 27.0290 5.3168
temp: 403.150 k
press: 1.00000 atm
elementType: 8 8 6 8 55 55 1 6 1 1 1 6 6 6 6 6 6 1 1 1 6 1 1 1 6 6 6 6 6 6 1 1 6 1 1 1 6 1 1 1 6 1 1 1 6 1 1 1 6 8 6 6 6 6 6 6 1 1 1 1 1 6 1 1 1
symmnumber: 1
zpe: 1360675.9 jmol-1
zpe.correction: 0.518254 hartree
zpe.thermalcorrener: 0.582525 hartree
zpe.thermalcorrenthalpy: 0.583802 hartree
zpe.thermalcorrgfe: 0.391912 hartree
zpe.sumelectzpe: -1387.432105 hartree
zpe.sumelectthermal: -1387.367834 hartree
zpe.sumelectthermalent: -1387.366557 hartree
zpe.sumelectthermalfe: -1387.558447 hartree
dipole: 2.6445 2.7393 1.7168
dipole: 4.1767
quadrupole: -164.5226 -244.6814 -221.7488
quadrupole: -9.4280 22.0319 7.1750
quadrupole: 45.7950 -34.3638 -11.4312 -9.4280 22.0319 7.1750
hfenergy: -1387.9503591 hartree
pointgroup: C01 [X(C27H32Cs2O4)]
dipole: -1.0404171 1.0777215 -0.6754593 debye
polarizability: 442.6781506|-8.8002142|334.5553044|22.4532979|-18.8623641|328.8062482 unknown
InChI: InChI=1/C9H8O4.2C9H12.2Cs/c10-8(6-14-13-9(11)12)7-4-2-1-3-5-7;2*1-7-4-8(2)6-9(3)5-7;;/h1-5H,6H2;2*4-6H,1-3H3;;/q-2;;;2*+1/rC9H8Cs2O4.2C9H12/c1-2-4-7(5-3-1)8-6-16-15-9-10(13-9)14(9)11(9,15)12-8;2*1-7-4-8(2)6-9(3)5-7/h1-5H,6H2;2*4-6H,1-3H3
charge 0 multiplicity 1
65 atoms
O  0.578244 -0.592591 0.828281
O  0.472927 0.819858 -0.903165
C  0.398467 -0.381055 -0.477508
O  0.123185 -1.370521 -1.221319
Cs 3.041852 1.35046 0.690634
Cs -2.561907 0.099688 -1.283583
H  -5.857843 -1.546006 1.006402
C  -5.786052 -3.723605 -0.634066
H  -6.138969 -4.63175 -0.124453
H  -5.487699 -4.026356 -1.646956
H  -6.645495 -3.046277 -0.720571
C  -4.649898 -3.089859 0.114041
C  -3.363222 -3.636023 0.040909
C  -2.29589 -3.099528 0.760505
C  -2.533276 -1.970493 1.5580
C  -3.804544 -1.40884 1.658567
C  -4.85518 -1.974795 0.924588
H  -3.193723 -4.515146 -0.585903
H  -1.688095 -1.518451 2.083159
H  2.148981 -2.042158 -0.945802
C  3.17881 -0.525641 -2.898254
H  2.822748 -1.321112 -3.567594
H  3.809244 0.152675 -3.489054
H  2.279084 0.016498 -2.563384
C  3.916481 -1.092609 -1.720712
C  5.265829 -0.813365 -1.485561
C  5.915608 -1.286129 -0.341173
C  5.178468 -2.020654 0.592964
C  3.82918 -2.315332 0.380782
C  3.216935 -1.859491 -0.787541
H  5.826568 -0.216119 -2.209977
H  5.66993 -2.371654 1.504307
C  -0.917733 -3.670199 0.660976
H  -0.445619 -3.739003 1.650502
H  -0.928482 -4.672099 0.211412
H  -0.297413 -2.99738 0.040365
C  -4.05444 -0.190399 2.499135
H  -4.95345 -0.307049 3.11989
H  -3.210565 0.022017 3.167812
H  -4.218066 0.706161 1.878417
C  2.998896 -3.047571 1.392268
H  2.062034 -2.495631 1.568636
H  2.713601 -4.045784 1.029308
H  3.52802 -3.178702 2.345655
C  7.378832 -1.027208 -0.128806
H  7.632815 -0.972234 0.938192
H  7.991963 -1.831399 -0.561153
H  7.701284 -0.091095 -0.60397
C  -0.215612 2.678411 1.374624
O  0.820282 3.353438 1.270283
C  -1.40038 3.093937 0.540505
C  -1.17711 3.614379 -0.737865
C  -2.711143 3.032817 1.020173
C  -2.239193 4.038579 -1.527448
C  -3.779753 3.473671 0.239202
C  -3.546619 3.970655 -1.040779
H  -0.152345 3.658191 -1.099821
H  -2.895968 2.66524 2.03002
H  -2.050364 4.433006 -2.525573
H  -4.79358 3.441783 0.638922
H  -4.377645 4.320176 -1.652733
C  -0.332773 1.488503 2.179898
H  -1.352944 1.190783 2.4469
H  0.136998 0.470437 1.451717
H  0.32282 1.49985 3.060327
