program: Gaussian 16
title: Title Card Required
version: ES64L-G16RevA.03
method: RB3LYP
basis: Gen
operation: Freq
keyword: #P
keyword: Geom=AllCheck
keyword: Guess=TCheck
keyword: SCRF=Check
keyword: GenChk
keyword: RB3LYP/ChkBas
keyword: Freq
converged: YES YES YES YES
title: Mulliken charges:
elementType: C C C C C C C H H H H N N C H H H C H H H C C C C H C H C H H H
charge: 0.127335 0.127896 0.020080 0.042195 0.042382 0.020353 0.319134 0.007835 0.003807 0.003805 0.007945 -0.244898 -0.244903 0.077005 0.079988 0.081354 0.079254 0.077076 0.080036 0.081378 0.079290 -0.091712 0.043379 0.043633 0.044355 -0.002696 0.044318 -0.002631 0.044057 0.003082 0.003070 0.002796
chargesum: 1.00000
title: Mulliken charges with hydrogens summed into heavy atoms:
elementType: C C C C C C C N N C C C C C C C C
charge: 0.127335 0.127896 0.027915 0.046002 0.046187 0.028298 0.319134 -0.244898 -0.244903 0.317601 0.317780 -0.091712 0.040683 0.041003 0.047437 0.047389 0.046854
polarizability: 2.12200018e+02 1.38558492e+01 3.50479238e+02 3.11990470e+01 -2.28553705e-01 1.38214907e+02
1716.lowfreq: -6.8242 -0.0007 -0.0004 0.0002 3.3632 5.9546 54.0227 57.3216 78.0516
frequency: 53.8368 57.2854 78.0392 134.1001 147.0004 155.2787 159.2920 199.6432 258.2268 263.7982 285.9075 315.6920 318.3911 383.7057 413.1961 453.3411 496.9569 548.3987 573.9393 585.3957 620.5119 625.4321 635.5871 710.3638 713.7961 722.4895 764.3020 774.6629 780.1819 835.9845 841.8676 868.5268 871.3385 958.7432 962.7489 1003.1422 1010.5188 1015.8767 1029.7674 1036.0029 1041.4203 1045.8836 1085.6719 1105.1317 1128.0227 1136.2248 1142.5124 1152.0710 1152.5703 1173.2324 1180.5863 1194.9666 1282.9508 1283.5818 1329.9925 1351.8800 1360.8356 1383.4440 1405.5388 1421.4161 1442.8782 1453.0489 1453.8874 1465.1263 1467.7819 1473.7162 1492.3067 1515.4576 1518.9465 1550.9283 1588.3445 1628.6902 1653.3284 1662.2137 1669.5540 3073.0634 3073.9170 3155.9732 3157.2735 3190.7857 3193.8772 3194.5055 3197.8651 3199.0302 3202.9962 3210.9446 3211.1905 3217.2038 3224.4451 3227.2732
redmass: 3.9176 4.0803 4.2523 1.4381 1.1795 2.1908 2.0465 4.2935 3.2948 3.7887 3.4446 3.9459 4.2326 4.4339 2.9023 3.4538 3.6668 5.4582 5.1063 3.7232 5.6404 6.1663 4.1718 5.7772 1.9169 3.7746 1.3397 4.4801 2.1813 3.9243 4.0185 1.2424 1.4279 1.3642 1.3489 1.3732 1.3037 5.9678 1.3286 2.0048 5.9319 2.6394 1.8611 1.5567 1.7707 1.3197 1.3194 1.6491 1.3683 1.0761 1.3145 1.1356 2.7430 2.5709 1.7094 2.1416 3.6733 3.5644 6.8493 1.3771 1.2307 1.0431 1.0432 1.4133 1.1692 1.5375 2.6795 2.3349 3.1705 3.9490 5.5723 5.9438 6.0209 7.7848 7.6109 1.0340 1.0340 1.1069 1.1070 1.0862 1.1042 1.1041 1.0889 1.0873 1.0925 1.0915 1.0963 1.0998 1.0953 1.0975
irintensity: 0.4103 0.2076 0.4870 2.0146 0.4169 0.4414 7.0302 0.2968 0.1144 5.9222 1.8323 0.0009 0.1628 1.1934 2.3814 3.3437 7.9646 4.7173 16.9880 0.2184 1.5582 0.3131 4.2507 0.0410 44.2687 4.0754 93.8190 0.1859 12.1102 21.5462 17.9300 1.3638 0.0057 5.4107 2.1643 0.8822 0.0060 9.3858 0.0186 13.6695 8.2275 14.0254 2.8292 19.2287 6.7183 0.0456 4.6992 6.2837 18.6358 0.0918 13.7439 2.6786 4.1492 4.6926 1.8038 0.6398 8.0820 7.5539 15.4213 66.9836 0.0528 1.9533 37.1675 7.0923 0.0397 3.1848 141.5456 0.7610 77.5413 148.9379 68.0299 2.5258 27.4644 4.0004 3.7569 29.0574 13.2958 3.6979 3.9592 0.0479 0.1699 0.1570 0.6888 2.5398 8.7989 9.6293 15.5874 12.6189 3.1660 3.8920
temp: 298.150 k
press: 1.00000 atm
elementType: 6 6 6 6 6 6 6 1 1 1 1 7 7 6 1 1 1 6 1 1 1 6 6 6 6 1 6 1 6 1 1 1
symmnumber: 1
zpe: 704527.2 jmol-1
zpe.correction: 0.268340 hartree
zpe.thermalcorrener: 0.282505 hartree
zpe.thermalcorrenthalpy: 0.283449 hartree
zpe.thermalcorrgfe: 0.227283 hartree
zpe.sumelectzpe: -689.847963 hartree
zpe.sumelectthermal: -689.833798 hartree
zpe.sumelectthermalent: -689.832854 hartree
zpe.sumelectthermalfe: -689.889020 hartree
dipole: -40.5973 4.8525 0.3680
dipole: 40.8879
quadrupole: 270.3501 -56.2352 -94.6864
quadrupole: -39.8589 1.2966 0.3916
quadrupole: 230.5406 -96.0447 -134.4959 -39.8589 1.2966 0.3916
hfenergy: -690.116303 hartree
pointgroup: C01 [X(C15H15N2)]
dipole: -0.0023581 -0.0235724 -0.0014349 debye
polarizability: 212.2000179|13.8558492|350.4792377|31.199047|-0.2285537|138.2149065 unknown
InChI: InChI=1/C15H15N2/c1-16-13-10-6-7-11-14(13)17(2)15(16)12-8-4-3-5-9-12/h3-11H,1-2H3
charge 1 multiplicity 1
32 atoms
C  -8.96329622 2.926586 0.08196587
C  -7.56580677 2.78448986 0.12466623
C  -6.71434398 3.89143403 0.16293365
C  -7.32387755 5.14494848 0.1565753
C  -8.72726631 5.28760287 0.11446402
C  -9.57557807 4.18229149 0.07601546
C  -8.47797678 0.74517946 0.07375128
H  -5.63116754 3.78212293 0.19956193
H  -6.69960488 6.03883822 0.18612873
H  -9.15960069 6.28893232 0.11053008
H  -10.65862245 4.29283725 0.03927477
N  -7.30436851 1.41498959 0.11313666
N  -9.49355246 1.63733736 0.05685724
C  -5.96317964 0.83619144 0.07134584
H  -5.37610712 1.36497071 -0.69054053
H  -5.47912424 0.94258311 1.05157219
H  -6.03533296 -0.22252243 -0.19484184
C  -10.923379 1.33673103 0.08546842
H  -11.39872106 1.96723033 0.84756188
H  -11.36991055 1.54304108 -0.89657334
H  -11.06518356 0.28304452 0.34368797
C  -8.62642835 -0.71387657 0.05283553
C  -8.06152634 -1.49121232 1.07856233
C  -9.33400433 -1.33185275 -0.9926872
C  -8.20908705 -2.87795784 1.05603815
H  -7.52676557 -1.00937944 1.89802483
C  -9.47167118 -2.71969072 -1.00823388
H  -9.75654992 -0.72974154 -1.79803109
C  -8.91191954 -3.4921454 0.01450529
H  -7.77691166 -3.47955954 1.85687042
H  -10.01477273 -3.19866772 -1.82412099
H  -9.0237839 -4.57766518 -0.00028419
