program: Orca
programVersion: 4.0.1.2
elementType: C H H C H H C H H N H H C H H H
charge: 0
multiplicity: 1
keywords: cc-pV5Z AutoAux printbasis DLPNO-CCSD(T) TightSCF
formula: C4H11N
InChI: InChI=1S/C4H11N/c1-2-3-4-5/h2-5H2,1H3
16 atoms
C  -3.547264 -1.084294 -0.003363
H  -3.276431 -2.149499 0.001051
H  -3.091957 -0.652627 -0.905678
C  -2.953923 -0.408245 1.238509
H  -3.223076 0.658915 1.234453
H  -3.399812 -0.840055 2.145096
C  -1.432551 -0.537587 1.324646
H  -0.985742 -0.131139 0.401177
H  -1.15917 -1.599317 1.368974
N  -0.913379 0.112153 2.54177
H  0.097105 0.000528 2.59713
H  -1.087411 1.115311 2.49803
C  -5.070963 -0.9459 -0.085453
H  -5.369962 0.109464 -0.120252
H  -5.470879 -1.43606 -0.981073
H  -5.55624 -1.399099 0.788258
elementType: C H N
totalener: -212.42632798 hartree
nucrepener: 185.00755566 hartree
electener: -397.43388363 hartree
oneelecener: -652.74851695 hartree
twoeener: 255.31463331 hartree
cpcmener: -0.00843283 hartree
kineticenergy: 212.08330362 hartree
e0: -212.424017589 hartree
corrType: DLPNO BASED
chargesum: -0.0000000
charge: 0.036365 -0.014092 -0.015565 0.036395 -0.010473 -0.013369 0.185123 -0.083931 -0.023599 -0.551359 0.231342 0.228116 -0.043211 0.007803 0.028116 0.002336
charge: 0.208804 -0.117136 -0.118012 0.204667 -0.113996 -0.116670 0.049739 -0.132113 -0.127938 0.862449 -0.318454 -0.315005 0.429707 -0.130898 -0.134411 -0.130734
qa: 0.0364 -0.0141 -0.0156 0.0364 -0.0105 -0.0134 0.1851 -0.0839 -0.0236 -0.5514 0.2313 0.2281 -0.0432 0.0078 0.0281 0.0023
va: 4.0847 1.0283 1.0298 4.0702 1.0308 1.0426 4.1046 0.9586 1.0184 3.2681 1.0079 1.0096 4.1174 1.0292 1.0279 1.0304
energy: -213.510059397671
dipole: -2.03189 2.34915 0.31726 -0.20758 0.47286 0.26528 -2.02340 1.44198 -0.58142
magnitude: 0.71349 au
magnitude: 1.81356 debye
