program: Gaussian 09
title: Title
version: ES64L-G09RevD.01
method: UB3LYP
basis: def2SVP
operation: Freq
keyword: #P
keyword: Geom=AllCheck
keyword: Guess=TCheck
keyword: SCRF=Check
keyword: GenChk
keyword: UB3LYP/def2SVP
keyword: Freq
converged: YES YES NO YES
polarizability: 2.87536466e+02 1.63564377e+01 2.57918711e+02 3.52062227e+01 3.57949865e+01 1.31639749e+02
1716.lowfreq: -5.8263 0.0006 0.0006 0.0007 7.9263 14.6062 27.0685 36.5081 48.0556
frequency: 26.3283 36.4559 47.5992 64.4359 101.8211 191.3521 217.9033 258.7136 279.2552 319.7949 354.4458 389.6213 421.6334 428.3870 467.2152 498.6681 520.0831 546.5134 561.0846 614.2707 628.4874 630.1115 654.4857 716.7185 725.7196 777.4884 778.1249 804.4446 837.9854 859.1424 874.3415 901.4410 914.1549 946.7141 993.0355 998.0145 1009.6985 1012.5014 1013.6235 1023.7514 1035.4180 1045.4255 1046.6136 1081.7363 1093.8415 1110.0608 1138.4546 1160.2192 1163.6123 1180.3542 1189.1361 1215.1522 1220.8748 1293.5529 1307.1936 1310.4021 1332.8996 1348.4783 1359.2637 1373.3257 1390.3336 1406.5894 1454.3545 1467.7483 1476.6476 1515.9715 1519.6995 1544.5239 1627.9587 1636.4984 1655.2022 1657.4577 2999.3279 3056.9418 3119.5283 3161.1889 3164.0203 3168.9863 3173.1083 3177.0278 3182.6492 3192.4845 3193.0319 3200.5234 3202.3346 3589.0167 3770.4782
redmass: 4.8276 4.0814 3.9249 4.6946 4.4151 4.6698 4.3651 4.4790 3.2248 2.9870 1.2172 3.3490 2.8053 2.9501 3.1026 2.0616 2.9256 3.2401 2.7580 2.2370 6.3301 6.3867 5.0743 1.6387 1.6084 1.9859 1.9894 3.6222 1.2574 3.9014 1.2557 1.5932 2.5242 1.4436 1.3867 4.9922 5.6545 1.3086 1.3960 2.1531 1.4422 2.1689 2.0974 2.2109 1.7393 2.0252 2.3374 1.0762 1.0754 1.1174 1.1169 1.3589 2.0042 1.5761 1.6693 1.5743 1.2898 1.4201 3.5101 4.0250 1.4861 1.4248 1.2007 1.8322 2.2709 1.9685 2.4023 2.3126 4.9818 6.0588 6.0380 6.0728 1.0848 1.0640 1.1048 1.0873 1.0886 1.0891 1.0885 1.0947 1.0931 1.0973 1.0970 1.0963 1.0947 1.0764 1.0666
irintensity: 0.6982 0.3509 0.5257 0.4816 0.6278 0.0845 1.2113 0.8723 9.9915 7.0001 171.4570 29.6987 2.3296 0.6918 32.8016 119.9577 21.9283 32.2944 84.4137 70.2296 2.4655 0.3043 1.2430 51.1424 63.0360 3.0277 87.2601 6.2633 0.2485 15.6333 0.1744 17.9947 11.3627 9.9426 0.3773 9.9820 0.2831 0.8362 0.0685 26.1604 2.4722 23.2276 17.8959 109.2638 10.6137 44.4799 23.6154 7.8023 0.4007 0.1954 17.8625 10.4054 22.8261 54.6629 75.6878 111.1664 9.0271 34.4799 1.3874 86.0191 5.9082 19.5589 12.0914 9.8325 17.3891 18.7525 36.1515 339.6797 21.4684 0.7388 264.4423 54.4754 51.0049 61.2307 18.3633 13.2276 8.6341 2.1880 0.6526 30.1825 22.3941 28.0270 20.9148 10.2312 7.5911 74.4342 101.3327
temp: 298.150 k
press: 1.00000 atm
elementType: 6 6 6 6 6 6 1 1 1 1 1 6 1 6 1 1 7 1 6 6 6 6 1 6 1 6 1 1 1 8 1
symmnumber: 1
zpe: 682799.8 jmol-1
zpe.correction: 0.260065 hartree
zpe.thermalcorrener: 0.273760 hartree
zpe.thermalcorrenthalpy: 0.274705 hartree
zpe.thermalcorrgfe: 0.217718 hartree
zpe.sumelectzpe: -671.802075 hartree
zpe.sumelectthermal: -671.788379 hartree
zpe.sumelectthermalent: -671.787435 hartree
zpe.sumelectthermalfe: -671.844421 hartree
dipole: -1.3732 -0.7514 -1.9779
dipole: 2.5224
quadrupole: -97.1064 -89.8425 -102.8801
quadrupole: -7.1088 -4.6192 -5.3299
quadrupole: -0.4967 6.7672 -6.2704 -7.1088 -4.6192 -5.3299
hfenergy: -672.0621396 hartree
pointgroup: C01 [X(C14H15N1O1)]
dipole: -0.5402506 -0.2956388 -0.7781777 debye
polarizability: 287.5364656|16.3564377|257.9187113|35.2062227|35.7949865|131.6397491 unknown
InChI: InChI=1S/C14H15NO/c16-14(12-7-3-1-4-8-12)11-15-13-9-5-2-6-10-13/h1-10,14-16H,11H2
charge 0 multiplicity 1
31 atoms
C  -1.45824203 -1.0786437 -0.88948251
C  -0.11221901 -1.13136631 -0.50528088
C  0.53679471 0.02506888 -0.06299739
C  -0.14965657 1.24862663 0.00491836
C  -1.49751817 1.2932821 -0.38055805
C  -2.14756466 0.13737905 -0.82783976
H  -1.96555392 -1.98179583 -1.23941563
H  0.43492005 -2.07686318 -0.55569351
H  1.59032787 -0.01852168 0.2300025
H  -2.028847 2.24630888 -0.33393821
H  -3.19781308 0.18706963 -1.12893438
C  0.54693842 2.48503698 0.54480339
H  1.60503838 2.46210772 0.2197917
C  0.53035117 2.49940669 2.08528037
H  0.94833398 1.55616413 2.46527562
H  -0.52165572 2.53753336 2.41104833
N  1.22310298 3.6310283 2.66158423
H  0.73102732 4.5100817 2.53335196
C  2.60169786 3.75680973 2.66874695
C  3.18083751 5.02868046 2.90222908
C  3.4744165 2.65749233 2.49184863
C  4.56378364 5.18707173 2.96805111
H  2.52209817 5.89251182 3.03385289
C  4.85996146 2.83191591 2.56297312
H  3.07246706 1.66219075 2.29774453
C  5.42201363 4.09054985 2.80122659
H  4.97777907 6.1833257 3.14995735
H  5.50886553 1.96222451 2.4229747
H  6.50612022 4.21780739 2.85127617
O  -0.07149424 3.69747007 0.14264157
H  0.02731986 3.7847214 -0.81773483
