program: Gaussian 09
title: Fac complex
version: EM64L-G09RevD.01
method: UB3LYP
basis: GenECP
operation: Freq
keyword: #P
keyword: Geom=AllCheck
keyword: Guess=TCheck
keyword: SCRF=Check
keyword: GenChk
keyword: UB3LYP/GenECP
keyword: Freq
converged: YES YES NO YES
polarizability: 5.42150660e+02 -2.84487454e+00 4.88828752e+02 2.42730910e+00 5.01802225e+00 5.54784915e+02
1716.lowfreq: -18.8481 -16.8613 -11.8517 -0.0113 -0.0066 -0.0042 19.0932 22.7082 27.3726
frequency: 19.0728 22.5408 27.0717 35.0034 37.5176 47.5697 57.6462 62.8980 76.1554 80.6233 83.6944 92.0001 93.3736 107.5769 120.4392 133.4940 138.2729 158.2976 174.4783 175.9963 193.5715 205.5020 215.2145 230.1841 236.8765 241.8574 265.3551 286.5219 314.0946 334.6539 345.7898 372.2960 386.1520 412.7291 422.8217 425.0035 428.8022 435.3501 440.0274 449.6981 451.6651 463.0100 469.4724 473.0772 481.5715 493.2381 537.5353 559.8079 577.4604 592.4745 606.4093 623.0390 636.5530 656.6181 661.9483 672.3693 673.0883 735.7078 744.0942 746.1427 750.4708 771.0759 772.2494 789.2598 823.7366 847.8043 859.0627 869.3695 873.9817 883.4749 908.1465 913.0757 924.3094 943.2822 961.6618 963.0853 976.8216 983.9903 988.8864 994.0188 996.1361 1020.0551 1022.7957 1026.2471 1028.4931 1037.2355 1045.1631 1049.2874 1058.8525 1062.3684 1068.8089 1075.8951 1079.4794 1085.4885 1105.4436 1121.9533 1129.4380 1133.5141 1134.4176 1175.2249 1177.6349 1183.5520 1205.5189 1215.9707 1233.0348 1249.5029 1257.5134 1266.6699 1294.0593 1298.9758 1301.1454 1311.3202 1314.9344 1316.7559 1321.4416 1328.4389 1333.8664 1348.4203 1360.9298 1363.2892 1391.1069 1401.5886 1410.9129 1412.8240 1422.0988 1447.9090 1450.1651 1452.0231 1452.1726 1480.1237 1483.7591 1489.9686 1492.3973 1504.8345 1511.1458 1518.8392 1524.0499 1531.1478 1540.9629 1551.2982 1620.5541 1624.3712 1654.2555 1660.6332 1691.4928 2143.8571 2385.0747 3062.3390 3068.5832 3076.5583 3077.6766 3084.6370 3088.3583 3103.0142 3124.7653 3131.1245 3132.9311 3147.7418 3147.9991 3150.0244 3176.4728 3177.9382 3203.4125 3206.3637 3212.7850 3215.5806 3221.8215 3226.1617 3227.5223 3229.3340 3233.1092 3238.1461 3246.3725 3250.0150
redmass: 4.9842 5.8375 6.2011 6.4901 4.0662 4.1215 4.2700 6.5586 4.1757 1.1812 5.4903 6.0204 6.2495 5.5107 6.5888 5.8254 4.6329 6.4191 6.6743 4.7950 4.8755 4.4586 4.6355 5.3899 4.5249 3.1953 6.5008 3.1164 7.3330 3.4977 3.9473 2.7908 4.8773 2.5599 2.9227 4.3499 2.8603 4.0495 3.7337 3.9890 11.2142 11.8930 3.5478 3.1467 2.9334 3.1481 3.0213 4.9839 3.9468 1.3096 3.2587 4.6167 4.6828 6.3719 5.7458 2.4660 1.8832 3.1846 11.3384 5.5845 3.6739 1.2846 1.2759 2.5715 3.3769 4.1909 4.0393 2.6752 1.7143 2.7821 1.2962 1.4433 1.2489 2.7494 2.4514 4.7497 1.9563 2.2990 1.4646 2.4244 1.5599 1.8979 1.3420 1.3769 2.1737 7.5090 7.3738 2.3737 1.4518 1.4401 1.8230 2.3339 2.2105 3.0530 1.9152 2.3943 1.6095 1.5394 1.8461 1.0950 1.1011 1.7842 2.3520 1.5840 2.7420 1.6394 1.9559 1.5672 1.3967 1.5187 1.7945 2.3106 2.2767 1.8370 2.3602 1.4924 1.4927 1.2927 1.3178 2.2955 1.4341 1.4935 1.2385 1.5650 1.3991 1.3958 1.0370 1.0366 1.6697 1.6790 2.0568 1.1370 1.2638 1.1336 1.0848 2.3701 2.2127 1.1114 1.1015 3.3645 5.9519 6.3540 5.5723 5.8654 7.2152 12.7424 12.5534 1.0689 1.0331 1.0629 1.0626 1.0607 1.0635 1.0663 1.1034 1.1053 1.1043 1.1024 1.1037 1.1036 1.0975 1.1011 1.0885 1.0901 1.0887 1.0890 1.0902 1.0951 1.0920 1.0926 1.0960 1.0983 1.0963 1.0938
irintensity: 0.1332 2.4247 4.3170 9.0194 2.2586 13.6593 2.3523 17.4233 5.8522 0.7771 21.2313 0.9706 8.5808 2.2911 5.6972 2.7564 5.0245 5.2228 5.8074 18.5553 9.2409 0.1609 5.4764 13.5233 1.6222 4.6642 16.1477 1.6080 31.6806 5.1884 8.9139 0.4801 3.8766 7.3778 0.5391 1.4207 17.2483 5.2656 19.5623 0.5400 4.5956 3.2562 1.2558 5.3493 1.6328 9.1983 11.5879 7.1831 21.4100 150.4562 4.6068 7.1184 4.6048 3.7460 5.9372 34.6660 22.8152 25.9049 28.5983 6.5336 12.2513 49.9496 80.7027 36.4458 2.0050 18.2387 17.2868 9.0932 20.4060 48.5330 1.3324 12.3887 0.8569 52.0372 113.7469 10.4246 14.3769 52.2376 6.4184 32.4945 5.7012 13.6753 0.4591 0.6389 9.1878 33.0665 16.6383 34.4778 10.0997 9.0423 20.2775 41.7281 23.3917 31.6615 25.7988 11.7803 8.8578 7.2130 16.2426 7.5605 8.8824 4.0417 4.6803 76.9811 156.4468 0.8049 4.2191 2.4444 30.6379 12.6909 17.5542 44.2747 16.1890 2.2388 21.0335 26.1494 24.6884 15.7526 4.4475 70.4312 67.4118 7.5675 2.4847 63.4442 11.9966 8.0793 25.3072 22.7424 14.3185 80.0468 15.3265 31.7299 4.3912 24.8582 5.7445 23.1727 51.9496 20.1273 25.8757 17.1174 13.0320 33.3442 101.4145 77.6641 13.6746 744.3922 6.6198 109.2673 0.3305 21.7648 5.4738 38.2321 55.8699 5.8682 10.0701 4.4629 15.3369 24.5296 1.6782 1.4533 27.7888 8.9203 1.7152 27.6117 3.4782 3.3902 0.2067 11.9397 3.8083 17.5322 4.9511 10.5720 7.0355 4.3357
temp: 298.150 k
press: 1.00000 atm
elementType: 26 7 6 6 6 1 6 6 1 1 1 7 6 6 6 6 1 6 1 1 1 7 6 6 6 1 6 6 1 1 1 7 7 6 1 1 6 1 1 6 1 1 6 1 1 6 1 1 6 1 1 7 6 6 1 1 1 7 6 16
symmnumber: 1
zpe: 1273358.4 jmol-1
zpe.correction: 0.484997 hartree
zpe.thermalcorrener: 0.516497 hartree
zpe.thermalcorrenthalpy: 0.517442 hartree
zpe.thermalcorrgfe: 0.418642 hartree
zpe.sumelectzpe: -1835.355365 hartree
zpe.sumelectthermal: -1835.323864 hartree
zpe.sumelectthermalent: -1835.322920 hartree
zpe.sumelectthermalfe: -1835.421720 hartree
dipole: 2.0457 -13.2975 3.3215
dipole: 13.8579
quadrupole: -143.0132 -228.8934 -202.2515
quadrupole: -3.8276 8.4608 24.5253
quadrupole: 48.3728 -37.5074 -10.8654 -3.8276 8.4608 24.5253
hfenergy: -1835.8403617 hartree
pointgroup: C01 [X(C24H27Fe1N7S1)]
dipole: 0.9717779 -6.8652572 1.3807571 debye
polarizability: 542.15066|-2.8448745|488.828752|2.4273091|5.0180222|554.7849151 unknown
InChI: InChI=1S/C21H24N5.C2H3N.CNS.Fe/c1-4-10-22-19(7-1)15-24(16-20-8-2-5-11-23-20)13-14-25-17-21-9-3-6-12-26(21)18-25;1-2-3;2-1-3;/h1-12H,13-18H2;1H3;;/q-2;;;+2
charge 1 multiplicity 4
60 atoms
Fe 0.18588558 0.89697768 -0.56056782
N  -0.15251811 -1.20329601 -0.249948
C  -1.29903925 -1.88705146 -0.41096775
C  0.8952034 -1.79391157 0.34979356
C  -1.45117242 -3.19397204 0.03712713
H  -2.10765088 -1.35424327 -0.90097344
C  0.81756713 -3.09728551 0.84483819
C  -0.373134 -3.80460281 0.68586636
H  -2.39169049 -3.71470093 -0.10991972
H  1.67503504 -3.54223582 1.34005716
H  -0.46009791 -4.8197937 1.06205354
N  -2.11726832 1.29319098 3.01494331
C  -1.68070872 2.61911866 2.95974694
C  -3.0822744 0.88929565 3.93865036
C  -2.07879332 3.52218366 3.8990835
C  -3.49819193 1.79053199 4.88978401
H  -3.42233472 -0.13667944 3.8684402
C  -2.99954796 3.12018405 4.92202959
H  -1.70247791 4.54027173 3.85261437
H  -4.22563272 1.45979638 5.62617081
H  -3.33427179 3.82435298 5.67547793
N  1.23846986 0.65426473 -2.29891531
C  0.74553009 0.41476617 -3.52536829
C  2.57858377 0.68874812 -2.11019979
C  1.57308985 0.20216517 -4.62352866
H  -0.33439054 0.39505152 -3.61427746
C  3.46713181 0.48097909 -3.16104106
C  2.95621096 0.23835809 -4.43773991
H  1.1372326 0.01318694 -5.59886639
H  4.53611663 0.50504773 -2.97571679
H  3.62941326 0.07267746 -5.27358998
N  1.98675092 0.4742059 0.23942241
N  -0.43174794 1.29626735 1.44524364
C  3.01101606 1.00672757 -0.70410761
H  3.04492966 2.09303973 -0.5859917
H  4.00411746 0.60284151 -0.48161984
C  2.17886066 -1.00737456 0.38980489
H  2.73771587 -1.21798873 1.3067599
H  2.79780807 -1.35360143 -0.44381962
C  -0.80759142 2.72429317 1.73828036
H  -1.36285205 3.11049872 0.87957125
H  0.08260291 3.33713078 1.87808338
C  0.73212442 0.88046513 2.30130235
H  0.63486513 -0.1870558 2.50909149
H  0.72162071 1.40731573 3.26104918
C  2.02254993 1.16766331 1.55897077
H  2.89041751 0.84347213 2.14534374
H  2.12164422 2.23888172 1.36804488
C  -1.66210858 0.56134246 1.84591185
H  -1.44564271 -0.47996453 2.07989595
H  -2.39060406 0.61613371 1.02854576
N  -1.51114653 1.31103931 -1.36398806
C  -2.50523391 1.6081076 -1.87553994
C  -3.7455499 1.99618635 -2.52038403
H  -3.68875952 1.772235 -3.59083421
H  -4.58296806 1.44613084 -2.07878571
H  -3.90759248 3.07085819 -2.38582486
N  -0.19829981 3.74472394 -3.70859809
C  0.20800648 3.71696942 -2.60065164
S  0.77453439 3.68102719 -1.0397711
