program: Gaussian 09
title: opt freq
version: EM64L-G09RevD.01
method: RB3LYP
basis: GenECP
operation: Freq
keyword: #P
keyword: Geom=AllCheck
keyword: Guess=TCheck
keyword: SCRF=Check
keyword: GenChk
keyword: RB3LYP/GenECP
keyword: Freq
converged: YES YES YES YES
title: Mulliken charges:
elementType: C H H C H C C H C H C H C H C C C H C H C H H C H H C C H C C H H H C H H H C H H H Au P C H H H C H H H C H H H O C H H H O H C H
charge: -0.048163 0.153068 0.171331 -0.211883 0.170829 0.121632 -0.213463 0.157754 -0.125566 0.158878 -0.145234 0.161444 -0.150355 0.180842 0.033170 0.259190 -0.340217 0.265046 -0.180033 0.116144 -0.303158 0.143759 0.146071 -0.331945 0.141748 0.146952 0.190555 -0.191944 0.132261 0.187249 -0.512271 0.154093 0.153589 0.153309 -0.517997 0.156586 0.157185 0.156641 -0.560937 0.187484 0.161540 0.160034 -0.114843 0.678499 -0.660065 0.213603 0.224699 0.222318 -0.667564 0.223283 0.215278 0.224474 -0.659170 0.214667 0.225844 0.226768 -0.465963 -0.223342 0.163604 0.165090 0.183863 -0.646172 0.427785 -0.011943 0.194068
chargesum: 1.00000
title: Mulliken charges with hydrogens summed into heavy atoms:
elementType: C C C C C C C C C C C C C C C C C C C Au P C C C O C O C
charge: 0.276236 -0.041054 0.121632 -0.055709 0.033312 0.016209 0.030487 0.033170 0.259190 -0.075171 -0.063889 -0.013327 -0.043246 0.190555 -0.059683 0.187249 -0.051279 -0.047584 -0.051879 -0.114843 0.678499 0.000555 -0.004529 0.008108 -0.465963 0.289215 -0.218387 0.182124
polarizability: 4.05273572e+02 7.27567957e-01 3.98150251e+02 -5.18610079e+01 -2.80719256e+01 3.90685867e+02
1716.lowfreq: -3.0030 -0.0016 -0.0011 0.0001 4.5613 10.5379 17.9087 20.6738 29.2615
frequency: 7.4210 18.1668 28.5924 30.6927 38.2321 47.1959 55.0395 59.2640 68.9220 72.1419 75.8159 84.1740 90.0863 106.9402 110.1885 123.6813 131.2928 150.2422 152.5041 163.2343 174.4007 176.5331 184.0203 190.2938 201.1249 201.9713 215.6633 217.2046 219.6937 232.3953 238.9092 245.2355 250.3881 259.5274 268.7193 281.0867 296.4523 300.5075 318.8264 326.4788 338.5422 357.7715 360.8864 370.6960 383.7334 402.5713 413.6378 422.6055 461.6713 492.8970 519.7155 532.1347 557.2483 581.9419 588.8308 647.3626 649.2548 656.3607 668.5563 679.2681 730.0533 746.0629 749.6253 763.5178 770.3112 777.7901 800.1488 822.9558 828.6687 843.0020 862.6986 868.2871 890.8050 892.1963 894.7763 907.5904 916.6724 933.3345 967.5249 977.1542 985.5999 992.5193 996.0820 998.6160 1002.4148 1006.7412 1012.9060 1028.3819 1035.3859 1049.3626 1073.0659 1081.0158 1086.6554 1098.3824 1111.3443 1116.3009 1127.4837 1131.9375 1144.9228 1190.0131 1191.7262 1198.9290 1203.8673 1218.6414 1226.2668 1235.6305 1255.0300 1263.7347 1283.2654 1294.2275 1299.0444 1303.5067 1328.6480 1349.9471 1353.7722 1356.0264 1370.2475 1376.2547 1378.9690 1379.6269 1402.1352 1405.7639 1420.3479 1437.4491 1444.8674 1448.1928 1472.1788 1476.7682 1478.5251 1480.9350 1484.8479 1488.9017 1491.3013 1494.7645 1499.5653 1502.5293 1503.8524 1512.2958 1513.1614 1513.6751 1516.5765 1519.7348 1524.6440 1534.1070 1535.5223 1544.5841 1571.0659 1629.3497 1654.7223 1728.1079 1750.6538 2080.9776 3019.8589 3020.7191 3021.2947 3022.4537 3023.5482 3028.9580 3031.5618 3039.7273 3059.6382 3065.4413 3066.0352 3067.7625 3070.1790 3070.6377 3076.4415 3080.7484 3083.3632 3095.0319 3099.0961 3116.1682 3129.4407 3132.1089 3139.6150 3155.0051 3155.8547 3158.3835 3162.9979 3163.0421 3165.0184 3168.3651 3170.3075 3186.9540 3199.9876 3212.7217 3223.0969 3418.1559 3740.3009
redmass: 3.1053 4.5157 3.9306 4.0133 4.5276 3.7717 5.4777 4.7468 3.3803 2.9468 5.5652 2.9975 4.1036 3.7468 4.0078 3.4521 3.7851 1.9903 1.1127 2.9811 2.7995 3.7615 2.8663 3.0192 1.3356 1.0675 1.1377 1.3768 2.3625 2.3540 1.3813 2.1890 2.8365 1.9253 2.9270 3.0854 4.7813 3.7282 2.4666 1.3290 2.8681 2.8754 3.9115 3.8426 3.5779 3.3813 3.2722 2.8187 2.4383 2.8668 2.7543 3.9014 3.5898 4.6585 3.7471 3.4392 1.5844 4.5760 4.1406 2.5957 1.1412 4.0850 4.0332 3.6789 1.7321 1.3830 2.8761 1.8567 1.1621 3.4041 1.8940 2.2555 1.2504 1.2526 1.5808 1.7525 2.9678 3.1441 1.4779 1.4355 4.2860 1.6697 1.3819 1.3843 1.2901 1.4482 3.2114 1.2573 1.7462 2.0828 2.1312 3.0409 1.5917 2.5836 4.4079 1.6624 1.8352 3.1593 2.0389 1.2756 1.6251 1.7658 1.1563 1.7294 1.8311 1.5936 1.7187 1.6882 1.2663 1.4256 1.6018 1.5176 1.1235 1.6631 1.2077 1.2065 1.7023 1.1934 1.3977 1.3808 1.3275 1.2608 1.2158 1.3431 1.2492 1.2931 1.0526 1.0473 1.0623 1.3765 1.0508 1.0868 1.9300 1.0459 1.0432 1.1590 1.0750 1.0438 1.0550 1.0559 1.0686 1.0870 1.0608 1.0928 2.3112 1.0582 1.0705 5.8589 5.4980 6.7991 6.2846 6.3042 1.0585 1.0388 1.0819 1.0379 1.0622 1.0417 1.0523 1.0668 1.0989 1.1001 1.0329 1.0328 1.0323 1.0998 1.0841 1.0922 1.1035 1.0906 1.0980 1.1001 1.0867 1.0885 1.0962 1.1044 1.1040 1.1047 1.1002 1.1050 1.1044 1.0969 1.1038 1.0879 1.0888 1.0932 1.0961 1.1460 1.0665
irintensity: 0.1217 0.1648 0.4358 0.0191 0.2273 0.5625 0.0152 1.6038 1.9571 0.4251 3.1834 4.9354 2.1447 0.7201 0.6314 1.5299 1.2699 1.1186 0.5889 0.1232 2.2936 3.7984 3.8217 0.0295 2.3437 0.1970 0.3821 0.7211 1.0789 5.7415 0.0708 0.7069 20.7013 0.5709 13.0763 1.2674 9.4560 4.4837 16.9873 122.8434 12.2491 10.3259 14.8240 2.8047 2.9941 4.4594 1.9323 8.5373 6.9279 2.4418 2.0877 34.7027 1.0100 5.1595 21.8619 10.5355 60.7796 5.4172 7.5864 5.9085 46.4063 9.5139 10.1531 23.5046 4.8640 71.0975 4.3482 1.7922 0.0236 21.4760 14.9064 10.0818 6.1546 3.9624 2.3766 22.5023 21.3327 41.0314 8.8408 0.3786 40.5646 2.8360 44.2620 58.7158 6.0520 233.7582 16.5012 1.9725 4.9452 25.6065 1.3732 30.8640 5.2846 67.5055 129.5617 1.0522 37.3252 118.0280 12.6927 3.9274 15.8147 6.0566 0.3983 46.4212 1.3660 15.1635 18.5554 11.7354 11.4488 29.3803 26.4958 7.3795 0.0753 5.2792 11.1042 10.2351 14.1627 1.8124 12.9191 3.6934 9.9030 47.5536 0.7457 5.6410 0.3129 9.3785 0.2280 1.6734 1.6788 5.6517 15.5306 25.1805 6.0016 0.3639 12.5327 0.5782 0.8936 15.6471 8.2410 4.6292 10.8767 3.7745 14.8388 4.0271 12.7953 6.2004 6.7363 0.7654 3.0541 11.0829 3.9767 11.7788 98.9511 35.4031 21.1460 75.5410 11.7803 82.9857 52.0125 38.1488 76.6808 21.6933 15.7622 5.0667 1.2895 53.6523 10.1110 14.3398 90.2325 33.7150 55.7394 26.2856 30.4169 67.2050 48.2603 3.8270 1.5751 0.2932 25.6760 1.1826 1.9209 0.4382 1.1624 6.5002 9.0721 22.0132 13.9526 170.0103 49.6258
temp: 298.150 k
press: 1.00000 atm
elementType: 6 1 1 6 1 6 6 1 6 1 6 1 6 1 6 6 6 1 6 1 6 1 1 6 1 1 6 6 1 6 6 1 1 1 6 1 1 1 6 1 1 1 79 15 6 1 1 1 6 1 1 1 6 1 1 1 8 6 1 1 1 8 1 6 1
symmnumber: 1
zpe: 1468300.9 jmol-1
zpe.correction: 0.559246 hartree
zpe.thermalcorrener: 0.594719 hartree
zpe.thermalcorrenthalpy: 0.595663 hartree
zpe.thermalcorrgfe: 0.488342 hartree
zpe.sumelectzpe: -1563.706865 hartree
zpe.sumelectthermal: -1563.671392 hartree
zpe.sumelectthermalent: -1563.670448 hartree
zpe.sumelectthermalfe: -1563.777769 hartree
dipole: 36.9103 3.1381 -13.8828
dipole: 39.5595
quadrupole: 124.1687 -164.4973 -136.0049
quadrupole: 33.3938 -119.7925 -23.5110
quadrupole: 182.9466 -105.7195 -77.2271 33.3938 -119.7925 -23.5110
hfenergy: -1564.2661111 hartree
pointgroup: C01[X(C24H37Au1O2P1)]
dipole: 5.443459 -1.9011365 -3.5871651 debye
polarizability: 405.2735721|0.727568|398.1502508|-51.8610079|-28.0719256|390.6858674 unknown
InChI: InChI=1S/C21H28O2.C3H9P.Au/c1-6-21(23-5)20-13-8-7-12-19(20)18(15-22)14-17(4)11-9-10-16(2)3;1-4(2)3;/h1,7-8,10,12-14,18,21-22H,9,11,15H2,2-5H3;1-3H3;
charge 1 multiplicity 1
65 atoms
C  6.37649428 1.8810715 0.26343391
H  6.14441748 0.80762339 0.25264362
H  7.19679695 2.04224575 -0.451873
C  5.17308531 2.72185533 -0.18747666
H  5.46104544 3.75393038 0.05869164
C  5.02902113 2.69045679 -1.71514475
C  5.36970026 3.84724668 -2.43523105
H  5.71619853 4.72002706 -1.88772622
C  5.26479619 3.91079737 -3.82455994
H  5.53365584 4.82493634 -4.34599923
C  4.80274252 2.80108227 -4.53556453
H  4.70501389 2.83794941 -5.61653111
C  4.46050396 1.64144826 -3.84357641
H  4.0962677 0.77234437 -4.38163572
C  4.56841211 1.57608327 -2.44617782
C  5.3355083 -0.7296856 -1.89198997
C  6.1295456 -1.6696462 -1.93718248
H  6.63747308 -2.61116769 -1.8511664
C  0.20956854 2.38306187 3.54747615
H  -0.10900705 1.42548179 3.96386322
C  1.65629848 2.43582066 3.13179327
H  2.2740017 1.97510502 3.91486378
H  2.01233222 3.46600838 3.02554797
C  1.90019072 1.69702117 1.79058454
H  1.5077956 0.67283584 1.8743037
H  1.31319809 2.19699474 1.01161461
C  3.36790254 1.64351316 1.4052456
C  3.81831406 2.49596149 0.46732875
H  3.0732358 3.17064813 0.04230471
C  -0.71947163 3.34370513 3.41923908
C  -2.14541129 3.11464129 3.86326316
H  -2.44212705 3.84905204 4.62552579
H  -2.29247247 2.1127788 4.28001087
H  -2.84322139 3.24219763 3.02344888
C  -0.46424954 4.71251934 2.83499787
H  -1.12097954 4.88580732 1.97114863
H  0.56710379 4.85892722 2.50510349
H  -0.70275929 5.49706961 3.56665201
C  4.17513656 0.59674807 2.1445039
H  5.19791446 0.92217606 2.33776249
H  4.20796478 -0.34664227 1.57985072
H  3.70557872 0.36274479 3.10601528
Au 7.34014285 0.01730856 -2.86796521
P  8.90903257 1.44879863 -3.78794982
C  8.46066833 2.01428647 -5.47042353
H  9.2079598 2.72586645 -5.83609082
H  8.41064555 1.15495938 -6.14471369
H  7.48008227 2.49543905 -5.43260995
C  9.10519056 2.97387269 -2.7920204
H  9.43418972 2.71220404 -1.78264497
H  9.84546919 3.63051572 -3.26057264
H  8.14134227 3.48622563 -2.73081717
C  10.58329776 0.71962381 -3.92485691
H  11.27322019 1.45580463 -4.34949454
H  10.93323624 0.42060248 -2.93315584
H  10.54669673 -0.16198044 -4.57013765
O  3.05062331 -0.27635605 -2.39285224
C  2.44570991 -1.34477488 -1.66323886
H  3.10165146 -2.22477025 -1.61658534
H  2.18873763 -1.02917254 -0.64269022
H  1.53445305 -1.60624286 -2.20362986
O  6.75862326 2.31744266 1.56420241
H  7.5028943 1.76782005 1.85752648
C  4.20986765 0.25118448 -1.78020486
H  4.02826902 0.41210234 -0.71127667
