program: Gaussian 09
title: opt freq
version: EM64L-G09RevD.01
method: RB3LYP
basis: GenECP
operation: Freq
keyword: #P
keyword: Geom=AllCheck
keyword: Guess=TCheck
keyword: SCRF=Check
keyword: GenChk
keyword: RB3LYP/GenECP
keyword: Freq
converged: YES YES YES YES
title: Mulliken charges:
elementType: C H H C H C C H C H C H C H C C C H C H H C H H C C H C C H H H C H H H C H H H Au P C H H H C H H H C H H H C H O C H H H O H C H
charge: -0.021040 0.149292 0.140410 -0.195737 0.186609 0.131118 -0.213141 0.146844 -0.131305 0.151307 -0.139944 0.150584 -0.171761 0.164370 0.046505 0.220898 -0.176456 0.123585 -0.323223 0.160154 0.155832 -0.333276 0.160209 0.166690 0.239389 -0.238976 0.160773 0.187420 -0.512250 0.156287 0.156728 0.156303 -0.524690 0.161061 0.154368 0.160531 -0.527412 0.178114 0.171793 0.197266 -0.159521 0.673209 -0.655521 0.208257 0.221931 0.221090 -0.657999 0.208894 0.219813 0.220568 -0.657735 0.221750 0.208361 0.221453 -0.418997 0.230109 -0.454413 -0.237046 0.192042 0.185700 0.171941 -0.654010 0.424664 0.040924 0.199307
chargesum: 1.00000
title: Mulliken charges with hydrogens summed into heavy atoms:
elementType: C C C C C C C C C C C C C C C C C C Au P C C C C O C O C
charge: 0.268662 -0.009127 0.131118 -0.066297 0.020003 0.010640 -0.007391 0.046505 0.220898 -0.052871 -0.007237 -0.006377 0.239389 -0.078203 0.187420 -0.042933 -0.048731 0.019761 -0.159521 0.673209 -0.004244 -0.008724 -0.006171 -0.188888 -0.454413 0.312638 -0.229347 0.240231
polarizability: 4.11201543e+02 8.92105183e+00 4.47254081e+02 5.29483368e+01 3.46106566e+01 4.38798324e+02
1716.lowfreq: -156.4602 -1.5799 -0.0011 -0.0009 -0.0007 3.4234 7.2796 15.3745 22.9911
frequency: -156.4574 14.8013 22.9885 29.4534 32.2499 40.1866 45.2981 47.6675 54.4239 72.2462 84.6849 94.6427 95.3375 104.9976 116.0062 134.3323 140.7546 147.3698 156.9167 160.7598 162.8900 169.3087 183.6157 184.2941 189.3949 195.8991 200.9475 204.6402 213.2237 221.1571 226.2072 240.8681 242.3630 243.9220 254.3992 262.2792 289.3796 314.3529 323.5974 342.0693 349.7237 350.8972 378.6464 405.5379 411.3894 437.6857 441.2988 458.8239 470.8805 484.2472 498.8905 524.2969 530.9377 555.4139 592.5594 606.7225 650.1302 670.9735 673.9283 728.5686 733.3776 743.8259 746.2658 770.3933 770.7927 822.5586 824.7663 832.6624 856.0287 873.0066 876.7834 882.8125 888.2973 893.4399 902.6244 930.7651 938.6754 948.1713 969.7110 976.7271 984.4698 989.6024 991.2884 994.7957 998.3867 1002.6652 1013.7761 1027.6668 1030.1386 1047.0341 1068.3871 1080.1070 1089.6749 1095.5670 1108.2448 1116.9366 1136.8359 1142.6896 1149.4871 1191.7576 1194.2283 1203.4837 1207.3495 1213.8229 1229.4155 1230.5309 1249.2617 1262.8597 1286.4646 1305.0420 1314.3965 1324.6108 1328.3542 1333.0866 1337.9527 1353.1832 1354.4384 1361.1288 1373.8429 1376.1366 1402.6270 1405.7127 1420.3389 1437.7178 1440.6076 1444.7779 1468.3889 1473.6207 1476.6898 1477.3566 1482.1079 1487.0075 1488.4277 1489.9026 1495.5818 1496.7609 1497.2666 1503.8400 1509.2345 1513.5660 1514.7872 1516.1099 1517.7979 1527.8334 1531.1297 1537.9142 1547.5808 1630.0773 1656.1397 1664.4541 1750.9429 1893.3613 3005.5182 3023.9649 3028.6095 3032.6212 3036.8350 3037.5124 3044.5000 3051.7933 3054.3920 3063.6693 3065.8474 3066.4584 3066.4881 3069.4368 3073.9591 3092.1279 3095.5103 3105.4763 3115.9877 3119.9635 3137.2865 3151.2383 3152.8837 3154.0952 3154.3109 3159.7021 3160.6142 3160.8196 3161.6176 3162.0740 3165.0030 3196.3077 3211.8773 3235.7427 3242.0257 3286.2985 3750.9493
redmass: 5.9037 4.6498 4.7635 3.8137 3.3243 4.2762 3.8525 3.6824 4.5005 3.9532 3.8927 4.6273 3.8481 3.0307 3.3733 2.9946 2.7459 2.7166 1.3107 1.2069 2.2242 3.1753 2.6869 3.1410 2.6651 1.3941 1.2228 1.2315 1.0625 2.6122 1.0729 1.5893 1.7848 2.6320 3.0424 2.5469 3.8488 5.3836 2.5141 4.5672 3.8475 3.0876 3.8011 3.6776 2.4310 4.1769 3.3302 3.9081 3.1254 3.9210 3.6366 3.1451 3.3105 3.2541 3.8883 3.2766 5.1987 4.1732 4.6851 2.1205 1.8656 4.0335 4.1460 1.4861 1.4266 1.1603 1.8541 2.6403 2.3250 1.7412 2.7976 1.2691 1.2447 1.2565 1.7970 2.0176 3.7092 1.6845 1.4640 1.4690 3.8235 1.7006 1.3956 1.4327 1.4168 1.2939 2.5354 1.4089 1.4335 2.7871 1.7477 2.4470 2.2463 3.6612 6.3340 1.6579 2.0784 2.9044 2.1212 1.4675 1.3376 1.8405 1.1759 1.6073 1.7834 1.9215 1.1896 1.7949 1.2252 1.3165 1.4402 3.0162 1.1916 1.4744 1.5994 1.2075 1.2075 1.3767 1.1962 1.3440 1.1690 1.3092 1.1936 1.3482 1.4041 1.2396 1.3718 1.0525 1.0479 1.0479 1.0477 1.0477 1.1850 1.6194 1.0710 1.1511 1.0585 1.0724 1.0592 1.1023 1.0768 1.0466 1.0874 1.0544 2.3425 1.0912 1.0937 5.5996 5.4607 5.4602 6.2289 7.9190 1.0611 1.0386 1.0342 1.0439 1.0666 1.0757 1.0687 1.0854 1.0485 1.0328 1.0325 1.0326 1.0920 1.1001 1.0997 1.1069 1.0945 1.0986 1.0955 1.1004 1.0892 1.1044 1.1049 1.0929 1.1045 1.1046 1.1041 1.0864 1.1041 1.1011 1.0984 1.0869 1.0936 1.0912 1.0922 1.1061 1.0665
irintensity: 576.6088 1.0686 0.4505 1.1776 0.5294 0.7838 1.2469 0.5821 0.2761 0.5528 1.9516 0.0863 16.9289 1.3215 8.5148 0.1628 26.3855 18.6722 0.6664 0.5061 0.8937 5.9928 2.5215 0.8268 8.8458 4.2531 0.5832 5.0743 0.0218 12.5385 0.2548 128.0574 22.6609 3.8230 7.2188 1.0731 1.9460 10.1444 0.8402 1.1071 6.8266 6.5115 10.3484 3.3000 2.5187 28.9502 11.3576 44.7631 103.8869 55.1105 19.8058 0.9642 40.1238 18.5910 119.1040 5.6774 6.0277 14.9496 7.4056 27.3446 25.4181 9.0943 13.2305 15.0231 44.1834 0.0082 0.3232 25.3987 0.6888 7.8366 87.3317 350.6154 33.9079 105.4480 12.9121 37.0943 112.3149 92.6523 3.1585 1.2893 13.0336 15.4435 45.2597 160.9054 148.8877 0.2831 12.9514 0.8578 9.6075 5.7914 17.4933 52.1479 11.3909 18.8673 192.2202 1.0140 3.7116 34.3874 7.6740 14.3301 3.0208 10.2791 0.9270 20.3317 3.7465 5.9576 61.3575 7.0066 13.2708 4.9025 8.5131 14.1602 0.5207 10.4630 35.6670 9.7527 9.7302 6.9813 0.3708 16.9985 6.8978 8.2468 19.4855 5.3299 36.1854 3.0502 16.8231 0.0756 0.0535 0.1228 20.1739 20.6459 12.5249 20.9323 0.8082 3.2088 7.5231 0.4319 11.8596 27.0831 15.1313 13.9727 4.2625 15.9379 29.5870 15.0488 1.6088 0.7068 57.4360 371.1518 5.9930 390.8369 78.6116 46.5194 54.1562 65.5670 48.3986 7.5960 28.7859 26.3893 29.0600 7.3262 2.4606 4.2285 44.2436 19.0113 46.6856 40.7018 25.5054 11.5678 29.8589 17.4281 75.9771 6.1125 0.7764 56.3861 2.2987 2.7416 2.3564 19.5957 1.0467 21.6513 19.9205 4.3141 31.1607 26.8934 7.2188 44.4106 54.3672
temp: 298.150 k
press: 1.00000 atm
elementType: 6 1 1 6 1 6 6 1 6 1 6 1 6 1 6 6 6 1 6 1 1 6 1 1 6 6 1 6 6 1 1 1 6 1 1 1 6 1 1 1 79 15 6 1 1 1 6 1 1 1 6 1 1 1 6 1 8 6 1 1 1 8 1 6 1
symmnumber: 1
zpe: 1467551.4 jmol-1
zpe.correction: 0.558961 hartree
zpe.thermalcorrener: 0.593566 hartree
zpe.thermalcorrenthalpy: 0.594510 hartree
zpe.thermalcorrgfe: 0.490081 hartree
zpe.sumelectzpe: -1563.694625 hartree
zpe.sumelectthermal: -1563.660020 hartree
zpe.sumelectthermalent: -1563.659076 hartree
zpe.sumelectthermalfe: -1563.763505 hartree
dipole: 16.3921 -1.2651 -6.2228
dipole: 17.5791
quadrupole: -118.7195 -137.2801 -125.2721
quadrupole: 0.6939 -15.0242 30.3354
quadrupole: 8.3711 -10.1896 1.8185 0.6939 -15.0242 30.3354
hfenergy: -1564.2535862 hartree
pointgroup: C01 [X(C24H37Au1O2P1)]
dipole: 0.0444349 -1.1079136 -2.7483859 debye
polarizability: 411.2015434|8.9210518|447.2540812|52.9483368|34.6106566|438.7983244 unknown
InChI: InChI=1S/C21H28O2.C3H9P.Au/c1-6-21(23-5)20-13-8-7-12-19(20)18(15-22)14-17(4)11-9-10-16(2)3;1-4(2)3;/h1,7-8,10,12-14,18,21-22H,9,11,15H2,2-5H3;1-3H3;
charge 1 multiplicity 1
65 atoms
C  3.69390678 4.74970147 1.2882933
H  3.55520039 5.48782207 0.48819657
H  2.92967121 4.93517861 2.0592259
C  3.51874917 3.32205914 0.72117444
H  4.24617971 3.22150153 -0.09339362
C  2.11124973 3.08140867 0.14982324
C  1.36376133 4.16579686 -0.33704003
H  1.7828507 5.16427339 -0.31163112
C  0.08048457 4.0121338 -0.86128919
H  -0.45944628 4.88213767 -1.22388306
C  -0.498403 2.74718736 -0.90799437
H  -1.50030401 2.60792474 -1.30348857
C  0.22435711 1.65065847 -0.44167562
H  -0.21384338 0.66106773 -0.4801032
C  1.51920323 1.79614977 0.07244446
C  3.67700953 0.52351225 0.24925164
C  5.58850201 -1.33578981 4.36614732
H  6.48486049 -1.13904719 4.95680915
C  5.4781263 -0.51903231 3.10759737
H  4.7049521 -0.90747961 2.43904929
H  6.4243785 -0.5795399 2.5540111
C  5.16238132 0.96987934 3.42261415
H  4.2305916 1.01189043 3.99689223
H  5.9579321 1.36413214 4.07036477
C  5.05708802 1.84519664 2.19677244
C  3.8423648 2.32682329 1.81459254
H  3.01175636 2.13038699 2.49137953
C  4.70954399 -2.23025107 4.84548222
C  4.9687524 -2.95588482 6.14481718
H  4.16472654 -2.76195349 6.86854963
H  5.91851291 -2.65865044 6.60094943
H  4.98887069 -4.04362399 5.98855759
C  3.40985039 -2.60574346 4.17522449
H  3.38685579 -3.68113087 3.9506423
H  3.22696594 -2.06416453 3.244558
H  2.56353021 -2.41201436 4.84852115
C  6.337813 2.14526538 1.48004392
H  6.18958536 2.61946154 0.50915393
H  6.94929983 1.2433363 1.35707849
H  6.9190987 2.84411405 2.0932909
Au 3.98561656 -0.87631242 -2.17535832
P  3.37810122 -2.02867521 -4.09678216
C  2.36928519 -1.03655756 -5.26334192
H  2.11491323 -1.6370331 -6.14291063
H  1.45206377 -0.71097805 -4.76491674
H  2.93448053 -0.15370862 -5.57445263
C  2.37198849 -3.52071919 -3.74275727
H  2.09012176 -4.01862662 -4.67621862
H  2.9507757 -4.20973379 -3.12146673
H  1.47032411 -3.22682694 -3.19820246
C  4.80342496 -2.62715563 -5.08259808
H  5.40692095 -3.30619391 -4.47399861
H  4.45072247 -3.1524748 -5.97606001
H  5.42210199 -1.77634086 -5.38077734
C  4.67342392 0.17401513 -0.44893528
H  5.7374849 0.35196093 -0.38409861
O  1.63385151 -0.60632358 -0.10476934
C  1.83153325 -1.85002699 0.56857583
H  1.3205643 -2.60445781 -0.03180568
H  2.89692122 -2.10524894 0.63505743
H  1.3966013 -1.82204459 1.57637753
O  5.00991871 4.84774093 1.81656827
H  5.1279175 5.75212375 2.1457939
C  2.21416963 0.51174232 0.55114855
H  2.07888689 0.38896861 1.63407917
