program: Gaussian 16
title: ch3Ts-cn_6311+Gd
version: AM64L-G16RevA.03
method: RB3LYP
basis: 6-311+G(d)
operation: Freq
keyword: #P
keyword: Geom=AllCheck
keyword: Guess=TCheck
keyword: SCRF=Check
keyword: GenChk
keyword: RB3LYP/6-311+G(d)
keyword: Freq
converged: YES YES NO NO
title: Mulliken charges:
elementType: C C C C C C H H H H C H H H S O O O C H H H C N
charge: -0.572093 -0.101791 -0.764141 -0.072928 -0.486769 1.076625 0.274294 0.291699 0.291777 0.274623 -1.060895 0.272039 0.296607 0.272826 0.188451 -0.306490 -0.302602 0.060873 -0.501599 0.292180 0.294995 0.290987 -0.442118 -0.566549
chargesum: -1.00000
title: Mulliken charges with hydrogens summed into heavy atoms:
elementType: C C C C C C C S O O O C C N
charge: -0.297799 0.189908 -0.764141 0.218849 -0.212146 1.076625 -0.219423 0.188451 -0.306490 -0.302602 0.060873 0.376564 -0.442118 -0.566549
polarizability: 2.06903594e+02 2.00578025e+01 1.60720292e+02 -2.67364086e+00 1.74771188e+01 2.51311321e+02
1716.lowfreq: -0.0030 -0.0015 -0.0012 5.5617 6.8203 9.9335 18.6384 22.7723 33.2374
frequency: 18.3928 19.1735 33.2354 36.8777 47.2880 50.5602 70.6744 79.3897 101.9524 150.6701 167.7449 171.1280 263.7041 280.7960 314.3884 360.7046 386.0411 414.1848 472.3699 479.5017 522.1922 560.7579 644.3305 656.6248 698.8567 738.1751 818.2076 824.4643 841.5906 925.4536 977.6003 989.0187 1022.6891 1029.0921 1065.3581 1070.3820 1116.7865 1151.7305 1173.9671 1192.8338 1216.4339 1223.1065 1233.9377 1336.7852 1341.9472 1417.1102 1432.1870 1461.1992 1482.0192 1484.1830 1485.3332 1487.4968 1526.3127 1612.1976 1631.7758 2092.2891 3032.5496 3075.0110 3089.0209 3118.2945 3170.4312 3183.4745 3184.3394 3195.1419 3210.4373 3211.6032
redmass: 6.9156 7.0004 4.3902 6.5392 1.1634 9.2405 3.5049 2.6631 8.4259 1.4616 4.1904 3.7611 4.1805 7.6745 5.3327 4.7189 3.5618 2.8866 7.0101 8.8246 3.2554 6.8991 6.9649 7.2927 8.3232 3.0344 4.9700 1.4525 1.2499 10.8322 1.3385 1.3716 1.4104 4.2619 1.6169 4.5959 5.0615 1.3416 1.2544 1.3159 1.1624 16.6531 3.1580 5.7730 1.3704 1.2355 2.2870 1.1271 1.0427 1.1402 1.0462 1.0617 2.1895 5.8903 5.4528 12.8477 1.0416 1.0281 1.0951 1.1044 1.1113 1.0901 1.0908 1.1085 1.0937 1.0943
irintensity: 9.8593 6.5595 4.3630 4.8304 0.7445 20.9107 6.2115 10.1888 14.7094 0.3203 1.8133 5.2278 41.1354 1.9208 0.3147 4.2696 10.9510 0.0353 11.3340 27.5507 71.4431 109.2432 0.2414 108.7666 445.9295 32.3587 20.9821 45.8977 0.0526 508.5925 3.1056 0.0301 0.1914 48.8339 38.6440 141.4663 383.1959 29.2170 7.8633 14.8154 1.2122 543.7741 4.3758 1.2899 5.4215 3.2430 10.0805 1.6958 24.0287 27.1212 24.5718 15.2039 12.4545 2.4244 84.3630 39.9961 21.1277 38.0330 28.0857 28.6529 14.8833 16.1573 8.1219 4.7972 1.9169 2.0076
temp: 298.150 k
press: 1.00000 atm
elementType: 6 6 6 6 6 6 1 1 1 1 6 1 1 1 16 8 8 8 6 1 1 1 6 7
symmnumber: 1
zpe: 459805.7 jmol-1
zpe.correction: 0.175131 hartree
zpe.thermalcorrener: 0.191633 hartree
zpe.thermalcorrenthalpy: 0.192577 hartree
zpe.thermalcorrgfe: 0.125604 hartree
zpe.sumelectzpe: -1027.678454 hartree
zpe.sumelectthermal: -1027.661952 hartree
zpe.sumelectthermalent: -1027.661008 hartree
zpe.sumelectthermalfe: -1027.727981 hartree
dipole: -5.1557 -0.0725 -26.1054
dipole: 26.6098
quadrupole: -98.4879 -110.8109 -149.0574
quadrupole: 1.4241 -38.7499 15.3520
quadrupole: 20.9642 8.6412 -29.6053 1.4241 -38.7499 15.3520
hfenergy: -1027.8535847 hartree
pointgroup: C01 [X(C9H10N1O3S1)]
dipole: 0.6276986 0.9384686 -13.3090369 debye
dipolederiv: 0.0348566 0.0203255 -0.2131602 0.0217985 -0.1894561 -0.0912332 -0.1968664 -0.0871049 -0.4444759 -0.0016286 -0.0511732 -0.3465578 0.048365 -0.0739037 -0.0068917 0.1491719 0.0868772 0.1331967 -0.2065312 0.0508707 0.1085379 0.0610091 -0.3530834 -0.2632407 0.0626381 -0.0940667 -0.7445345 -0.0334241 0.071278 0.2800156 -0.0319317 -0.0626721 0.158401 -0.1901723 0.0047297 0.1430059 -0.0592078 0.0770434 0.2808897 0.0722149 -0.1518918 0.0482061 0.2615757 0.0406273 -0.3792201 0.1507193 0.0406888 -0.0451589 0.0470444 -0.011986 0.0356444 -0.0649874 0.1024281 0.8276786 -0.0487399 -0.0421842 0.0954921 -0.0392403 0.1796458 -0.0171607 0.0985043 -0.0052158 0.0505293 0.0691668 -0.038793 -0.0540009 -0.0426675 0.1702576 -0.0404154 -0.0738045 -0.0389326 0.096055 0.039096 -0.0278102 0.060393 -0.0242058 0.1807103 -0.0077787 0.0737404 0.0030292 0.1128015 -0.006378 -0.0678615 -0.0835323 -0.0682773 0.1615668 -0.0675471 -0.0926434 -0.0591845 0.0253595 0.1390096 -0.0050484 -0.0570283 -0.0155871 0.1378609 0.1845812 0.0312578 -0.0355497 -0.2440804 -0.0012841 -0.1233834 -0.0128053 -0.1116525 -0.0298269 -0.1338944 0.0007306 -0.0410541 -0.0069252 0.1193102 0.062942 0.0014534 0.0619962 -0.0614051 0.0554333 -0.0036027 0.055159 -0.1004536 -0.1365022 0.0602721 0.0830084 0.0555803 0.0941396 -0.0869845 0.0104484 -0.0223221 0.0022818 3.1436345 -0.0147626 0.0116404 0.031911 3.1722019 -0.2839096 -0.1167825 0.211948 3.978678 -1.6605163 0.3129399 0.364087 0.1671627 -0.8968055 0.0010092 0.2785959 -0.1223226 -1.2139898 -1.2219319 -0.4823247 -0.3371753 -0.354534 -1.2557129 -0.2237087 -0.2005087 -0.3065865 -1.294187 -0.7330183 0.120203 -0.0689285 0.0989651 -1.3658938 0.8131968 -0.0109267 0.5120355 -2.1081435 0.3407122 0.0670835 -0.1024918 0.0328476 0.2375523 -0.026179 -0.0018325 -0.3434012 1.2911661 0.0170432 -0.0899088 -0.0586346 -0.0989256 0.0371812 -0.0771645 -0.0100701 0.040728 -0.0439772 -0.0735036 0.0180707 0.0895298 0.0457472 0.1143614 -0.021874 -0.0157288 0.0528828 -0.0315669 0.1246402 0.0443205 0.0021836 0.0436015 -0.0341559 0.0471587 0.0084833 0.030351 -0.0314269 -0.3649223 0.2368427 0.1508937 0.2378871 -0.2533256 0.1895096 0.1535001 0.2019791 -0.4530557 -0.6306001 -0.2396307 -0.1486506 -0.2391089 -0.745359 -0.1851582 -0.1507205 -0.1870345 -0.564716 unknown
polarizability: 206.9035938|20.0578025|160.7202923|-2.6736409|17.4771188|251.3113209 unknown
InChI: InChI=1S/C8H10O3S.CN/c1-7-3-5-8(6-4-7)12(9,10)11-2;1-2/h3-6H,1-2H3;
charge -1 multiplicity 1
24 atoms
C  2.77380846 0.82131939 -4.59667829
C  2.62831463 1.07740701 -3.23786696
C  1.37604969 0.88729692 -2.65493545
C  0.27890628 0.44446184 -3.39379927
C  0.44960172 0.19460156 -4.75018077
C  1.69272258 0.38004573 -5.37171413
H  3.74305378 0.96729755 -5.06164053
H  3.4702968 1.41993019 -2.64882484
H  -0.68667653 0.30013385 -2.92448899
H  -0.39659816 -0.1492417 -5.3356089
C  1.85332756 0.13936234 -6.84733012
H  1.19379187 -0.65813878 -7.19632222
H  1.59555647 1.04403109 -7.40888499
H  2.88277253 -0.1209536 -7.10156186
S  1.18031795 1.18534094 -0.91913771
O  -0.21706064 1.5021093 -0.60271183
O  2.20801553 2.11542448 -0.43765268
O  1.51697703 -0.30296019 -0.35593029
C  1.4154082 -0.49373678 1.09498739
H  2.11806583 0.16017526 1.60940509
H  0.39359718 -0.3140176 1.4246588
H  1.68504381 -1.53420443 1.24910575
C  1.05072997 -1.25694639 4.29519425
N  1.70788347 -0.42295099 4.79644453
