program: Gaussian 16
title: ch3o
version: AM64L-G16RevA.03
frameworkgroup: C3V[C3(CO),3SGV(H)]
method: RB3LYP
basis: 6-311+G(d)
operation: Freq
keyword: #P
keyword: Geom=AllCheck
keyword: Guess=TCheck
keyword: SCRF=Check
keyword: GenChk
keyword: RB3LYP/6-311+G(d)Freq
converged: YES YES YES YES
title: Mulliken charges:
elementType: O C H H H
charge: -0.827991 -0.528583 0.118858 0.118858 0.118858
chargesum: -1.00000
title: Mulliken charges with hydrogens summed into heavy atoms:
elementType: O C
charge: -0.827991 -0.172009
chargesum: -0.99769
polarizability: 2.91650674e+01 -1.38679856e-12 2.91504458e+01 -1.78851009e-11 4.93377540e-03 3.73384366e+01
1716.lowfreq: -96.2180 -76.3467 -1.0659 -0.3930 2.5709 31.9882 1095.9754 1172.2065 1173.7632
frequency: 1095.9747 1172.1947 1173.7632 1473.4560 1474.2445 1488.5132 2630.5740 2632.5797 2701.9320
redmass: 8.9981 1.3146 1.3175 1.0563 1.0579 1.1353 1.0929 1.0932 1.0228
irintensity: 457.2837 0.5840 0.6701 12.8038 12.0410 126.9925 614.4394 610.9380 633.4103
temp: 298.150 k
press: 1.00000 atm
elementType: 8 6 1 1 1
symmnumber: 3
zpe: 94763.6 jmol-1
zpe.correction: 0.036094 hartree
zpe.thermalcorrener: 0.039005 hartree
zpe.thermalcorrenthalpy: 0.039949 hartree
zpe.thermalcorrgfe: 0.014873 hartree
zpe.sumelectzpe: -115.202329 hartree
zpe.sumelectthermal: -115.199418 hartree
zpe.sumelectthermalent: -115.198473 hartree
zpe.sumelectthermalfe: -115.223550 hartree
dipole: -0.0000 0.0000 -3.6542
dipole: 3.6542
quadrupole: -17.0045 -17.0045 -21.5815
quadrupole: -0.0000 0.0000 0.0000
quadrupole: 1.5257 1.5257 -3.0514 -0.0000 0.0000 0.0000
hfenergy: -115.2384226 hartree
pointgroup: C03V [C3(C1O1),3SGV(H1)]
dipole: 0. 0. -1.4376581 debye
dipolederiv: -0.9428725 0. 0. 0. -0.9454696 -0.0006669 0. 0.0008237 -2.1099687 0.8226044 0. 0. 0. 0.8235146 0.0020978 0. 0.0021273 2.0063223 -0.0287939 0.0000002 -0.0000001 0.0000002 -0.5528059 0.3678787 0. 0.2903944 -0.2984839 -0.4236368 0.227256 0.3183475 0.2280989 -0.1612075 -0.1843077 0.2527254 -0.1459369 -0.29871 -0.4236366 -0.2272562 -0.3183474 -0.2280991 -0.1612078 -0.1843079 -0.2527253 -0.145937 -0.29871 unknown
polarizability: 29.1650674|0.|29.1504458|0.|0.0049338|37.3384366 unknown
InChI: InChI=1S/CH3O/c1-2/h1H3
charge -1 multiplicity 1
5 atoms
O  0.0000 0.0000 0.80245489
C  0.0000 0.0000 -0.5574256
H  -0.0000003 1.02106183 -1.02967619
H  0.88426563 -0.51053065 -1.02967619
H  -0.88426533 -0.51053117 -1.02967619
