program: Gaussian 09
title: Title
version: ES64L-G09RevD.01
method: RB3LYP
basis: TZVP
operation: Freq
keyword: #PGeom=AllCheck
keyword: Guess=TCheck
keyword: SCRF=Check
keyword: GenChk
keyword: RB3LYP/TZVP
keyword: Freq
converged: YES YES YES YES
title: Mulliken charges:
elementType: B C H C H H C H H C H H C H C H H C H H C H H C C C H C H H C H H C H H H H H H
charge: -0.104274 -0.092630 0.149533 -0.264788 0.121841 0.123253 -0.217145 0.132834 0.117349 -0.280166 0.125320 0.123230 -0.095445 0.156201 -0.289766 0.127749 0.130665 -0.214607 0.134733 0.118737 -0.286851 0.130430 0.125113 -0.119856 -0.245850 -0.269877 0.139475 -0.205034 0.110063 0.123914 -0.215951 0.120515 0.134882 -0.220989 0.121666 0.101555 0.123751 0.105123 0.125278 0.100019
chargesum: 0.00000
title: Mulliken charges with hydrogens summed into heavy atoms:
elementType: B C C C C C C C C C C C C C C
charge: -0.104274 0.056903 -0.019694 0.033038 -0.031616 0.060756 -0.031352 0.038863 -0.031308 0.019619 -0.011873 -0.014481 0.018188 0.012922 0.004309
polarizability: 1.86980960e+02 2.41794002e+00 2.12489465e+02 2.88018704e+00 -3.44526589e+00 1.79903501e+02
1716.lowfreq: -7.7174 -0.0007 -0.0006 0.0009 5.3851 18.5764 25.5313 39.2982 91.9196
frequency: 25.1117 39.1224 91.9074 101.7085 130.4193 196.9858 222.0880 228.0439 255.4945 304.8585 313.0576 333.6233 369.0291 378.2498 440.0759 448.3808 481.4604 494.8855 549.7649 588.9174 651.5205 707.8276 744.1924 770.5683 779.7987 801.4640 810.1987 824.1017 855.3088 855.6407 868.8714 892.1063 907.4720 917.5476 919.4723 926.2543 935.3158 993.6384 1010.7341 1016.8531 1033.2529 1046.3962 1057.4543 1063.7153 1081.0163 1089.6982 1097.8269 1102.0137 1110.7316 1139.4123 1146.9322 1160.1338 1173.3628 1177.0359 1202.2508 1235.1313 1259.4544 1262.4945 1284.7783 1292.2103 1295.7462 1302.5936 1313.1171 1330.1501 1334.2372 1341.6119 1357.8766 1359.2201 1367.0724 1373.7683 1383.8366 1384.7384 1386.8138 1387.8978 1388.7837 1393.2992 1396.6365 1410.3071 1483.3289 1484.7256 1485.9735 1486.6921 1489.3744 1492.6744 1493.9833 1501.3490 1502.3121 1506.1515 1532.4334 2952.3642 2986.1133 2990.1513 2992.8831 2994.9887 2996.4441 2999.9163 3003.0325 3005.6458 3006.1341 3009.1269 3018.2655 3019.9347 3022.2351 3024.6931 3027.2702 3029.9477 3034.4248 3042.5243 3046.0292 3046.5516 3050.8975 3055.2876 3078.4435 3105.4913
redmass: 3.0404 3.2712 2.7237 2.4464 3.4427 3.3126 2.3309 1.9135 1.8940 2.0469 4.5394 3.0652 1.9386 1.6857 2.5639 3.0447 2.3688 2.0462 2.1659 4.4140 2.5338 2.6671 1.8858 3.0531 2.7573 1.8010 2.2351 3.0025 2.1828 1.3839 1.8749 2.0721 2.1413 2.3647 1.6071 2.5257 1.4561 2.1392 1.7421 2.0483 2.0884 1.9349 2.0253 2.5556 1.7522 2.7033 2.6304 1.1425 1.4093 1.6449 2.3168 1.1162 1.2679 1.2363 1.3810 1.4309 1.3694 1.4497 1.3929 1.2761 1.2397 1.2345 1.2549 1.2633 1.2319 1.5221 1.3161 1.3635 1.3433 1.3103 1.4294 1.4266 1.4015 1.3209 1.3629 1.4408 1.3840 1.6576 1.0821 1.0862 1.0777 1.0855 1.0935 1.0816 1.0832 1.0953 1.0825 1.0966 1.0849 1.0797 1.0664 1.0614 1.0612 1.0602 1.0677 1.0709 1.0631 1.0610 1.0623 1.0777 1.1019 1.1005 1.1034 1.1029 1.0794 1.0718 1.0752 1.0967 1.0997 1.0925 1.0981 1.1020 1.0942 1.0876
irintensity: 0.0257 0.0974 0.0229 0.0529 0.1260 0.1688 0.0881 0.0307 0.0285 0.0254 0.1753 0.0594 0.3195 0.0692 0.6001 0.3612 1.0351 1.2173 1.7578 0.7680 2.8072 4.0764 6.3684 0.8420 2.5854 0.2875 1.2929 0.0631 3.5685 0.2206 0.5264 8.3295 2.9335 4.6968 7.7044 0.3112 4.3493 57.0443 0.5389 0.3153 6.2547 4.1955 9.0076 6.8296 10.3029 1.6075 0.7560 1.0355 18.5361 0.1173 34.8880 0.1079 3.0701 4.8195 4.7795 3.7859 21.0147 52.4733 6.6022 4.3381 1.0068 1.0258 17.6729 5.0391 0.7404 13.5487 1.3996 32.0723 7.7045 0.0338 3.6586 5.0441 0.5389 2.4102 0.1254 2.4845 0.3817 36.1512 0.1509 0.4163 1.9684 4.5629 5.2735 9.2048 13.2200 13.1895 1.9280 0.5140 10.1676 22.4188 12.9421 52.6674 42.3830 9.2673 48.6065 17.6381 22.3563 73.9054 9.2558 148.3550 51.5443 70.2643 38.3785 30.1220 90.0938 116.6555 26.8891 105.2630 19.3400 110.7222 36.5893 139.8558 56.3678 75.5731
temp: 298.150 k
press: 1.00000 atm
elementType: 5 6 1 6 1 1 6 1 1 6 1 1 6 1 6 1 1 6 1 1 6 1 1 6 6 6 1 6 1 1 6 1 1 6 1 1 1 1 1 1
symmnumber: 1
zpe: 973179.3 jmol-1
zpe.correction: 0.370664 hartree
zpe.thermalcorrener: 0.384699 hartree
zpe.thermalcorrenthalpy: 0.385644 hartree
zpe.thermalcorrgfe: 0.329398 hartree
zpe.sumelectzpe: -573.285662 hartree
zpe.sumelectthermal: -573.271627 hartree
zpe.sumelectthermalent: -573.270683 hartree
zpe.sumelectthermalfe: -573.326928 hartree
dipole: -0.0147 -0.0250 -0.0656
dipole: 0.0717
quadrupole: -97.2504 -98.3949 -98.0423
quadrupole: 0.6333 -0.9174 0.1084
quadrupole: 0.6455 -0.4990 -0.1464 0.6333 -0.9174 0.1084
hfenergy: -573.6563263 hartree
pointgroup: C01 [X(C14H25B1)]
dipole: -0.0057921 -0.0098201 -0.0258016 debye
polarizability: 186.9809597|2.41794|212.4894649|2.880187|-3.4452659|179.903501 unknown
InChI: InChI=1S/C14H25B/c1-2-6-12(7-3-1)15-13-8-4-9-14(15)11-5-10-13/h12-14H,1-11H2
charge 0 multiplicity 1
40 atoms
B  0.22370087 0.30968458 -0.05090852
C  -0.34921842 1.1968829 -1.21901588
H  -0.71143151 0.59719867 -2.06223501
C  -1.54037644 2.04267239 -0.70128104
H  -2.37695549 1.3575886 -0.51946513
H  -1.88029602 2.72918676 -1.48580575
C  -1.27079128 2.83628392 0.58943628
H  -2.22575439 3.17843735 1.00107416
H  -0.71496268 3.74328212 0.35352863
C  -0.52048703 2.03738444 1.66936287
H  -0.1897737 2.7198792 2.46130425
H  -1.22604951 1.34581944 2.14531645
C  0.68362935 1.20122299 1.16167021
H  1.05797139 0.61898807 2.00917736
C  1.87984744 2.04819925 0.63224907
H  2.71914574 1.36569918 0.45264715
H  2.21594057 2.7357011 1.41710992
C  1.60493366 2.8378754 -0.66066975
H  2.55821208 3.18374082 -1.07298972
H  1.04365641 3.74159545 -0.42640165
C  0.85892143 2.03098681 -1.73864299
H  0.52467364 2.70542822 -2.53558713
H  1.56684699 1.33789071 -2.20962941
C  0.32831618 -1.25550991 -0.1622023
C  1.28383229 -1.96171719 0.81342287
C  -1.10660809 -1.83516353 -0.01100394
H  0.64485907 -1.49663386 -1.18932439
C  1.26796877 -3.4844269 0.63998916
H  0.99273613 -1.71919282 1.84204403
H  2.30183867 -1.58042854 0.68592291
C  -1.12516526 -3.35977533 -0.17494273
H  -1.49656535 -1.58026217 0.98243107
H  -1.78073051 -1.37484201 -0.73872599
C  -0.14980612 -4.04599969 0.78644219
H  1.93773956 -3.95663881 1.36524051
H  1.6545484 -3.73778283 -0.35459813
H  -2.13979166 -3.73992274 -0.0200747
H  -0.84953082 -3.60765052 -1.2066835
H  -0.15135786 -5.12701335 0.61766553
H  -0.49216145 -3.88980301 1.81668025
