program: Gaussian 09
title: opt freq
version: EM64L-G09RevD.01
method: RB3LYP
basis: GenECP
operation: Freq
keyword: #P
keyword: Geom=AllCheck
keyword: Guess=TCheck
keyword: SCRF=Check
keyword: GenChk
keyword: RB3LYP/GenECP
keyword: Freq
converged: YES YES YES YES
title: Mulliken charges:
elementType: C C C C H H C C C H H C H C C H H H C H H H P C H H H C H H H C H H H Au C H C H C C C C H C H C H H H
charge: 0.118077 0.113712 -0.160011 -0.123047 0.195781 0.161316 0.069428 -0.268250 -0.350462 0.192663 0.187794 -0.247706 0.175648 0.243452 -0.521141 0.192311 0.191363 0.181400 -0.517933 0.189421 0.183369 0.184597 0.664320 -0.657702 0.207814 0.220036 0.221389 -0.658688 0.208406 0.220268 0.219489 -0.655267 0.220650 0.220307 0.207936 -0.148256 -0.155485 0.161700 -0.196026 0.158750 0.102271 -0.175596 -0.161018 -0.142468 0.165926 -0.143766 0.171755 -0.133784 0.155900 0.155527 0.153827
chargesum: 1.00000
title: Mulliken charges with hydrogens summed into heavy atoms:
elementType: C C C C C C C C C C C P C C C Au C C C C C C C C
charge: 0.118077 0.113712 0.035770 0.038269 0.069428 -0.268250 0.029996 -0.072057 0.243452 0.043933 0.039454 0.664320 -0.008463 -0.010526 -0.006374 -0.148256 0.006215 -0.037276 0.102271 -0.009670 0.010737 0.013431 0.011761 0.020044
polarizability: 4.55007512e+02 -5.51824362e+00 4.90939148e+02 -2.68842958e+01 7.59466822e+00 2.97583062e+02
1716.lowfreq: -227.4107 -8.4401 0.0008 0.0008 0.0013 3.8632 5.4100 21.2390 24.6817
frequency: -227.4097 19.9370 24.0913 28.9857 34.4091 47.0812 58.7714 65.8353 68.2114 80.5644 106.4802 119.9929 134.0513 136.1051 154.7014 164.0647 169.3379 184.0309 187.2515 204.3253 210.2891 220.0852 220.5257 228.2609 246.8491 251.1674 253.5215 281.2248 345.5095 347.8651 363.4929 414.4000 428.0310 449.3304 465.1167 484.1360 497.6123 525.4968 559.4533 575.8078 581.4965 614.4401 636.0946 667.4026 673.9542 712.1967 722.8859 729.7404 742.3126 744.2530 773.3995 777.4429 791.5441 814.6124 823.2964 860.2849 865.4776 885.0675 885.3796 889.7191 915.3841 937.3739 958.7251 971.1480 978.5938 981.0120 991.0529 992.6492 999.0170 1000.2826 1004.7998 1013.1204 1018.9818 1032.3852 1054.9191 1069.2941 1105.1045 1111.4356 1119.0866 1130.3907 1171.6217 1198.4954 1202.0607 1210.3792 1215.1754 1222.5602 1255.3771 1284.6673 1305.3905 1327.3350 1334.8157 1352.7126 1354.4951 1363.9302 1373.3760 1374.0186 1394.1433 1430.7694 1438.1724 1472.4041 1475.6416 1476.8264 1483.2255 1485.7434 1485.8706 1488.1446 1490.5117 1496.9429 1497.3712 1504.2283 1506.6218 1514.2457 1525.6523 1535.8013 1622.5212 1625.1947 1631.8036 1646.5931 1650.3652 1864.0740 3043.9630 3049.8468 3054.9668 3063.0712 3063.7856 3065.1861 3089.3664 3095.7724 3103.1931 3150.0003 3150.7482 3152.4148 3158.2412 3159.6212 3161.6356 3168.7067 3175.3775 3192.5869 3196.6514 3197.4662 3202.8908 3206.0033 3209.7030 3212.6185 3213.2821 3221.4952 3223.2860
redmass: 7.6164 3.4346 3.5461 4.3717 5.4455 5.6094 3.0338 3.9911 5.8112 2.2259 3.3558 1.6150 3.5090 3.3015 3.0621 3.2469 3.4002 3.1549 1.0579 1.2044 2.5893 1.1424 2.0564 3.3436 2.5773 2.3615 2.5591 2.3526 3.9764 4.0455 4.3051 3.0124 2.4027 3.3503 2.9239 4.0470 3.1989 4.7826 4.9625 6.3635 5.6977 5.9040 6.6597 4.1454 4.1980 2.0819 2.9696 4.0255 4.1470 4.1498 1.4814 1.8880 2.9886 3.9559 1.1613 1.4102 3.1605 1.2462 1.3101 1.2469 1.3948 1.3966 1.4637 1.4320 1.6427 1.3454 1.3904 1.3802 1.4457 1.3044 1.2608 4.8064 1.3194 2.4760 2.3311 2.2963 1.7018 1.6112 2.9184 1.6303 2.2513 1.1048 1.1131 1.5085 1.1466 2.0217 1.6984 2.9173 1.6359 3.4196 3.7127 1.2082 1.2063 1.6685 1.7878 1.2820 1.3870 1.3113 1.2375 1.0529 1.0478 1.0475 1.0481 1.6520 1.1533 1.1242 2.1530 1.0436 1.1109 1.1274 1.1547 1.1794 1.7669 2.2022 5.5619 5.1560 4.1674 5.6420 5.4124 11.8782 1.0425 1.0428 1.0602 1.0328 1.0332 1.0324 1.1039 1.0981 1.0959 1.1044 1.1042 1.1049 1.1044 1.1045 1.1037 1.1000 1.0977 1.0859 1.0870 1.0879 1.0890 1.0912 1.0895 1.0931 1.0937 1.0981 1.0976
irintensity: 837.6626 1.5185 1.0591 1.5203 2.0267 0.0708 0.2734 0.2827 0.4776 1.5601 0.5346 8.2435 1.7795 8.9044 1.8129 0.9043 0.6039 0.1958 0.0444 0.1298 0.6082 0.9439 5.8490 4.0315 1.5007 29.7259 1.8270 0.2513 7.5369 11.4657 2.3958 0.6688 13.2022 7.3327 17.4491 28.2998 39.5122 14.3244 49.3304 24.9777 7.1635 142.9926 7.5269 14.4933 3.7868 30.6534 11.7982 145.1618 12.2792 12.1029 43.0750 189.6846 44.6501 16.4268 0.0007 0.6681 0.8556 5.7774 1.3678 7.1798 47.4981 6.4630 2.7921 0.8974 3.9891 0.3856 64.8708 43.7358 295.3596 25.4061 0.7407 3.7434 19.2011 2.9911 7.7883 3.6329 12.2121 8.7410 6.8637 13.6531 55.7425 0.0973 1.9947 5.8125 0.1548 14.2170 2.4272 15.2503 25.8005 1.8819 1.6240 10.2572 10.3606 1.0115 11.3246 0.6472 33.5095 41.2714 10.3700 0.2139 0.1231 0.1956 19.5427 21.3040 8.9735 1.3306 29.0437 9.3373 9.6817 22.4472 24.9688 42.2524 11.7175 36.9793 49.8726 17.3053 281.0153 26.8540 11.0360 373.5694 2.5908 34.8884 33.5467 8.9973 3.2529 2.1563 10.2188 2.3354 11.5690 1.9560 8.6613 1.0472 2.1667 2.5268 0.7320 9.1738 12.4590 4.7593 5.9361 0.4964 2.9438 20.2240 6.8375 28.2382 32.0350 31.5909 26.7300
temp: 298.150 k
press: 1.00000 atm
elementType: 6 6 6 6 1 1 6 6 6 1 1 6 1 6 6 1 1 1 6 1 1 1 15 6 1 1 1 6 1 1 1 6 1 1 1 79 6 1 6 1 6 6 6 6 1 6 1 6 1 1 1
symmnumber: 1
zpe: 1119724.5 jmol-1
zpe.correction: 0.426481 hartree
zpe.thermalcorrener: 0.453367 hartree
zpe.thermalcorrenthalpy: 0.454311 hartree
zpe.thermalcorrgfe: 0.366361 hartree
zpe.sumelectzpe: -1331.201509 hartree
zpe.sumelectthermal: -1331.174622 hartree
zpe.sumelectthermalent: -1331.173678 hartree
zpe.sumelectthermalfe: -1331.261628 hartree
dipole: -1.9426 -1.9097 0.6378
dipole: 2.7978
quadrupole: -85.1850 -131.9440 -152.8440
quadrupole: 1.0801 -3.8081 1.1644
quadrupole: 38.1394 -8.6197 -29.5197 1.0801 -3.8081 1.1644
hfenergy: -1331.6279893 hartree
pointgroup: C01 [X(C22H27Au1P1)]
dipole: -1.5627696 -0.6475019 0.2301339 debye
polarizability: 455.0075115|-5.5182436|490.9391478|-26.8842958|7.5946682|297.5830621 unknown
InChI: InChI=1/C19H18.C3H9P.Au/c1-16(2)12-14-18-10-6-7-11-19(18)15-13-17-8-4-3-5-9-17;1-4(2)3;/h3-12H,14H2,1-2H3;1-3H3;/rC22H27AuP/c1-18(2)15-16-19-11-9-10-14-21(19)17-22(23-24(3,4)5)20-12-7-6-8-13-20/h6-15H,16H2,1-5H3
charge 1 multiplicity 1
51 atoms
C  2.5525297 -2.51341763 -0.80284133
C  1.51216908 -1.91377273 -0.07075293
C  0.59037821 -2.71478615 0.63041794
C  1.71056204 -4.69754953 -0.18778333
H  -0.19272183 -2.24612426 1.21796928
H  1.79184118 -5.77953997 -0.23145118
C  1.43211179 -0.47217567 -0.07887555
C  0.72030049 0.59816262 -0.01605917
C  3.5407238 -1.57588336 -1.46685016
H  3.29106486 -1.46880922 -2.5293543
H  4.54903837 -2.00487452 -1.42641268
C  3.50813341 -0.2064143 -0.81443689
H  3.34741404 0.64583153 -1.46756151
C  3.92829364 0.05642976 0.4669586
C  4.34943371 -1.00873001 1.43796783
H  5.40837347 -0.8609033 1.68857098
H  3.79066049 -0.90808366 2.37661609
H  4.22274149 -2.02443454 1.06312855
C  4.05256177 1.46472918 0.97482021
H  3.43141068 1.61417424 1.8652106
H  5.0920417 1.63971222 1.28335401
H  3.77540198 2.21014992 0.22797867
P  -3.6675154 -0.20012237 0.07836573
C  -4.61636215 1.18790352 0.81090262
H  -5.6876865 0.96207996 0.79437047
H  -4.29279919 1.34500023 1.8435386
H  -4.42664849 2.10041216 0.23898451
C  -4.15997796 -1.68059367 1.0439935
H  -5.24783907 -1.80259574 1.02206385
H  -3.68463434 -2.56773505 0.61616214
H  -3.82669043 -1.56650351 2.07934496
C  -4.3943256 -0.44966654 -1.58729933
H  -4.2021809 0.4333699 -2.20298268
H  -3.92920079 -1.31833383 -2.06143426
H  -5.47432269 -0.61118737 -1.50749978
Au -1.36772567 0.14809362 0.04554356
C  0.68876244 -4.1021364 0.55992012
H  -0.0229777 -4.71850292 1.10076063
C  2.64354592 -3.90298767 -0.85906163
H  3.45375532 -4.36415168 -1.41715748
C  0.99848501 2.04008084 -0.06756155
C  1.444635 2.63197954 -1.26084867
C  0.80926915 2.84123057 1.07092395
C  1.73927164 3.9962356 -1.29824807
H  1.55695422 2.02246411 -2.15244242
C  1.11420493 4.20085716 1.0287662
H  0.44453013 2.38599087 1.98721761
C  1.58396689 4.78246552 -0.15349565
H  2.09022085 4.44308972 -2.22407266
H  0.9836331 4.80780391 1.92010605
H  1.81754681 5.84259584 -0.18429913
