program: Gaussian 09
title: opt freq
version: EM64L-G09RevD.01
method: RB3LYP
basis: GenECP
operation: Freq
keyword: #P
keyword: Geom=AllCheck
keyword: Guess=TCheck
keyword: SCRF=Check
keyword: GenChk
keyword: RB3LYP/GenECP
keyword: Freq
converged: YES YES YES YES
title: Mulliken charges:
elementType: C C C C H H C C C H H C H C C H H H C H H H P C H H H C H H H C H H H Au C H C H C C C C H C H C H H H
charge: 0.126570 0.078414 -0.188847 -0.129177 0.183295 0.152734 -0.123419 -0.030245 -0.368352 0.189212 0.186622 -0.226890 0.199026 0.245086 -0.526468 0.202003 0.203998 0.190977 -0.518208 0.203855 0.199234 0.188009 0.656673 -0.656350 0.205471 0.218335 0.218685 -0.655892 0.205409 0.218402 0.218679 -0.657679 0.219247 0.218390 0.205387 -0.178669 -0.152477 0.152455 -0.208890 0.148639 0.065566 -0.151098 -0.155206 -0.138100 0.173055 -0.139315 0.174842 -0.128621 0.162091 0.162265 0.161279
chargesum: 1.00000
title: Mulliken charges with hydrogens summed into heavy atoms:
elementType: C C C C C C C C C C C P C C C Au C C C C C C C C
charge: 0.126570 0.078414 -0.005552 0.023557 -0.123419 -0.030245 0.007482 -0.027863 0.245086 0.070510 0.072890 0.656673 -0.013860 -0.013403 -0.014654 -0.178669 -0.000022 -0.060251 0.065566 0.021956 0.019636 0.023990 0.022950 0.032658
polarizability: 4.93341092e+02 2.69946459e+01 4.91407801e+02 2.14303335e+01 3.72182307e+00 2.78864862e+02
1716.lowfreq: -339.6851 -0.0015 -0.0011 -0.0004 3.2536 6.9179 9.9515 24.9131 28.4859
frequency: -339.6844 24.8695 28.3016 32.1171 34.8328 50.1515 52.3958 66.1595 81.4092 86.4443 103.3358 115.5875 147.2429 161.2256 163.2077 164.7726 176.4490 186.0548 189.9906 193.2240 206.1452 216.6598 231.9084 240.1012 245.5832 249.4007 256.0381 295.1694 348.4831 351.0243 368.6016 413.8963 419.7334 437.8057 472.7840 494.7542 507.8125 535.3063 551.0577 566.4096 597.5051 620.0456 636.3815 659.9016 667.5573 711.4522 740.9083 742.4759 745.8398 767.4537 779.7366 784.7523 814.2355 819.7114 850.9651 865.8598 879.0871 884.6213 885.7443 895.1176 908.0344 948.7727 954.7142 961.6622 972.2514 987.4230 987.9994 992.9460 997.2820 998.2249 1012.6087 1014.5945 1031.2809 1052.1255 1055.8749 1074.7749 1095.5848 1112.2166 1126.1518 1136.5386 1173.8362 1200.4884 1201.7870 1216.2141 1222.5732 1229.9564 1255.0667 1282.3844 1313.2463 1327.5794 1339.5582 1351.9350 1352.3874 1364.3442 1372.3738 1372.9952 1398.7717 1420.9023 1424.9427 1472.6859 1476.3861 1477.2788 1477.5114 1483.9175 1484.6186 1488.0078 1488.3148 1494.0302 1497.4791 1497.8129 1502.2844 1508.7415 1525.2701 1533.4658 1602.5619 1622.4642 1624.3703 1647.1347 1656.3347 1758.8414 3037.8683 3045.7070 3048.8045 3061.9480 3064.2539 3065.1099 3090.0269 3090.7522 3098.2822 3141.6926 3148.7739 3150.7022 3151.9182 3154.9260 3157.8068 3158.0041 3160.1042 3176.5009 3186.3718 3190.3287 3197.3010 3203.3407 3203.5532 3211.2237 3217.4805 3217.6474 3224.6734
redmass: 9.2491 4.5461 4.2822 3.1041 4.3504 4.3461 5.0848 3.4362 1.4755 5.3839 3.4863 3.7830 2.5754 2.7403 3.1914 2.9238 2.5459 1.2923 1.1308 3.8218 1.0641 4.1041 1.0999 3.8813 3.3933 2.6458 2.6216 4.1684 3.9206 2.9711 4.2643 4.0097 3.1111 2.6840 3.0557 2.6061 3.4594 3.9845 3.9060 5.6014 5.3112 5.4829 6.5302 6.4537 4.1689 1.9364 4.1602 4.1247 2.7555 3.1539 1.7774 1.8158 4.6830 1.1612 3.6643 1.2430 1.6910 1.2402 1.2464 2.2886 1.5406 1.4018 1.4783 1.4201 1.4575 1.3530 1.3860 1.3782 1.4635 1.2900 1.2748 6.1069 1.5065 2.1957 2.1473 2.3058 1.8236 1.6196 1.8201 2.1826 2.8548 1.1048 1.1005 1.1471 1.4546 2.0251 1.6403 3.1097 1.5351 3.6241 3.3125 1.2088 1.2097 1.6334 1.8417 1.2164 1.4421 1.2620 1.2964 1.0524 1.0478 1.0546 1.0488 1.0490 2.1106 1.0482 1.1647 1.2720 1.0436 1.6772 1.2065 1.0800 2.3167 2.1751 3.2234 5.5552 5.1074 5.3363 5.7837 11.8111 1.0407 1.0439 1.0591 1.0329 1.0326 1.0325 1.0995 1.0985 1.0960 1.0876 1.1043 1.1045 1.1048 1.1014 1.1044 1.1043 1.1036 1.0982 1.0871 1.0893 1.0861 1.0882 1.0921 1.0918 1.0975 1.0951 1.0983
irintensity: 1218.2019 1.3808 1.7125 0.4305 2.0788 0.7122 1.5739 0.3465 1.5113 0.4905 1.5570 1.0127 0.2312 0.9695 1.2406 1.0459 2.4010 1.5692 0.2254 0.6740 0.0107 5.2018 0.2197 4.1008 17.9503 0.4837 0.4996 1.1231 9.8796 7.9753 22.7638 8.2319 4.0503 2.8535 4.8902 8.2671 6.0150 92.7364 6.1230 25.2906 2.9883 28.8094 4.6094 71.8662 19.5844 66.5336 12.2669 14.1727 26.2565 255.6146 2.0211 176.9693 8.6948 0.0076 1.0542 0.0932 22.6772 5.7783 10.5334 59.0873 9.2792 0.3726 1.2349 6.5393 0.2918 0.0899 43.6878 44.6639 332.1075 6.5298 0.1027 6.4558 49.8244 9.1390 3.4946 6.6632 19.9813 8.3625 15.1155 46.5798 62.2597 0.1388 1.2721 6.1261 2.2625 5.8416 12.0181 47.6766 7.6043 1.2514 8.2862 11.4865 10.2364 2.7163 3.7949 0.3080 60.8001 85.6206 19.7509 0.4665 0.0419 2.0313 0.1499 18.0687 12.6372 17.5399 14.9706 3.0631 7.3688 4.2484 89.8157 109.0543 6.3944 8.7495 415.7635 3.3034 2.6560 1.7254 1.3374 243.6531 0.5749 4.3554 24.1286 11.0892 4.4230 2.9175 12.0178 4.8049 4.5854 5.7599 10.1372 3.3075 1.0550 12.0708 3.1478 2.9539 0.9135 13.1869 14.4597 1.2797 0.9145 1.5741 32.5110 14.2121 44.8253 25.1191 20.2798
temp: 298.150 k
press: 1.00000 atm
elementType: 6 6 6 6 1 1 6 6 6 1 1 6 1 6 6 1 1 1 6 1 1 1 15 6 1 1 1 6 1 1 1 6 1 1 1 79 6 1 6 1 6 6 6 6 1 6 1 6 1 1 1
symmnumber: 1
zpe: 1119900.9 jmol-1
zpe.correction: 0.426548 hartree
zpe.thermalcorrener: 0.453199 hartree
zpe.thermalcorrenthalpy: 0.454143 hartree
zpe.thermalcorrgfe: 0.367302 hartree
zpe.sumelectzpe: -1331.198019 hartree
zpe.sumelectthermal: -1331.171368 hartree
zpe.sumelectthermalent: -1331.170424 hartree
zpe.sumelectthermalfe: -1331.257264 hartree
dipole: 1.3355 4.2343 0.5275
dipole: 4.4712
quadrupole: -78.3471 -131.2068 -155.1034
quadrupole: -2.4440 2.2133 0.3850
quadrupole: 43.2053 -9.6544 -33.5510 -2.4440 2.2133 0.3850
hfenergy: -1331.6245665 hartree
pointgroup: C01 [X(C22H27Au1P1)]
dipole: -0.304169 1.6603183 0.1531683 debye
polarizability: 493.3410923|26.9946459|491.4078013|21.4303335|3.7218231|278.8648623 unknown
InChI: InChI=1/C19H18.C3H9P.Au/c1-16(2)12-14-18-10-6-7-11-19(18)15-13-17-8-4-3-5-9-17;1-4(2)3;/h3-12H,14H2,1-2H3;1-3H3;/rC22H27AuP/c1-18(2)15-16-20-13-9-10-14-21(20)22(23-24(3,4)5)17-19-11-7-6-8-12-19/h6-15H,16H2,1-5H3
charge 1 multiplicity 1
51 atoms
C  2.1924121 -2.84892893 0.33077653
C  0.94013405 -2.3652579 -0.10716953
C  -0.04225064 -3.28101148 -0.52245967
C  1.44598882 -5.12638129 -0.06422343
H  -1.00451476 -2.90638798 -0.86090533
H  1.6470106 -6.19364336 -0.0438132
C  0.68215901 -0.92069429 -0.09934044
C  1.52078505 0.0844789 -0.10971524
C  3.24354424 -1.86072675 0.76848514
H  2.98526674 -1.45919184 1.7565471
H  4.21126293 -2.36528678 0.87116464
C  3.37743512 -0.72835038 -0.23672808
H  3.28402804 -1.03580286 -1.2791452
C  4.15161831 0.40001066 -0.01892564
C  4.59642289 0.84935865 1.33249428
H  4.15711012 1.83326898 1.54725295
H  5.68478841 0.99238048 1.32928746
H  4.33302983 0.16323459 2.13748044
C  4.54603126 1.27639017 -1.16227468
H  5.64126305 1.26937977 -1.25387706
H  4.254068 2.31645661 -0.97154273
H  4.11374683 0.95106375 -2.11091977
P  -3.47499168 0.6930068 0.09776132
C  -3.85997756 1.56090462 1.66859056
H  -4.88921782 1.93431076 1.65198168
H  -3.17029066 2.39976218 1.79850419
H  -3.73616124 0.86979063 2.50702768
C  -3.85446761 1.91627945 -1.21671725
H  -4.881107 2.28159702 -1.1099108
H  -3.73434132 1.4463149 -2.19679246
H  -3.158193 2.75628126 -1.14181415
C  -4.77445537 -0.59255393 -0.06281249
H  -4.65941632 -1.32827438 0.73803077
H  -4.667035 -1.10040237 -1.02548267
H  -5.76814596 -0.13721902 0.0002824
Au -1.30052049 -0.13568376 -0.00969951
C  0.20924374 -4.65136974 -0.50876622
H  -0.55761495 -5.34559725 -0.83978811
C  2.42897236 -4.22505915 0.35045739
H  3.39310359 -4.59379651 0.69181162
C  1.48424518 1.54091583 -0.05625422
C  1.42860641 2.29394778 -1.24258078
C  1.46113605 2.20227386 1.18565631
C  1.33977669 3.68474524 -1.18500723
H  1.44563043 1.78129504 -2.19933912
C  1.37580812 3.5936812 1.23589076
H  1.49480068 1.61692215 2.09937267
C  1.31554932 4.33609572 0.0522589
H  1.28990464 4.25938461 -2.10509578
H  1.35200986 4.09724685 2.1977548
H  1.24906815 5.41927885 0.09413534
