program: Gaussian 09
title: opt freq
version: EM64L-G09RevD.01
method: RB3LYP
basis: GenECP
operation: Freq
keyword: #P
keyword: Geom=AllCheck
keyword: Guess=TCheck
keyword: SCRF=Check
keyword: GenChk
keyword: RB3LYP/GenECP
keyword: Freq
converged: YES YES YES YES
title: Mulliken charges:
elementType: C C C C H H C C C H H C H C C H H H C H H H P C H H H C H H H C H H H Au C H C H Br
charge: 0.098043 0.094321 -0.192487 -0.137723 0.194760 0.155703 0.099720 -0.300733 -0.372510 0.227696 0.208384 -0.070071 0.282471 0.053489 -0.501321 0.204476 0.209747 0.222491 -0.500067 0.213169 0.216548 0.214700 0.655306 -0.655315 0.203884 0.216552 0.217289 -0.657785 0.204509 0.217051 0.215908 -0.654049 0.216979 0.216968 0.203823 -0.089897 -0.151079 0.156276 -0.192997 0.156935 -0.101165
chargesum: 1.00000
title: Mulliken charges with hydrogens summed into heavy atoms:
elementType: C C C C C C C C C C C P C C C Au C C Br
charge: 0.098043 0.094321 0.002273 0.017980 0.099720 -0.300733 0.063570 -0.070071 0.335960 0.135393 0.144350 0.655306 -0.017590 -0.020317 -0.016279 -0.089897 0.005197 -0.036061 -0.101165
polarizability: 3.85482246e+02 3.67728138e+00 3.92168792e+02 -1.20043540e+00 -1.46223108e+01 2.14508704e+02
1716.lowfreq: -510.1195 -8.7705 -1.7018 0.0004 0.0011 0.0012 6.5875 25.2715 34.6076
frequency: -510.1188 24.6664 34.1537 41.2101 50.1420 68.0906 83.2004 97.4596 118.3684 122.0873 154.0430 166.3581 170.6610 182.0656 190.0363 196.3295 206.7188 212.6847 214.7719 232.2506 237.5688 250.0627 252.2855 259.4475 290.5784 345.6025 347.8378 376.6712 401.6984 433.1858 476.0706 496.2560 549.8437 572.4191 590.7119 626.0041 668.8441 672.4013 717.0737 735.9208 742.2270 744.8293 751.0666 760.2544 782.1496 821.4306 830.1071 872.2825 884.1979 885.4870 886.7433 949.8071 972.0954 982.8388 990.7277 991.0427 993.9884 996.3974 1001.4481 1013.1939 1056.4101 1101.7891 1108.3815 1137.3782 1142.3839 1195.3874 1196.3351 1201.6001 1243.3033 1280.8914 1303.7359 1334.0780 1352.3358 1353.2722 1374.2767 1374.7890 1427.4417 1439.1468 1447.4328 1474.3267 1477.9768 1478.3544 1482.3351 1487.1912 1488.1899 1488.6428 1495.9595 1498.3645 1504.6774 1507.9596 1512.2868 1524.3485 1574.1216 1585.4418 1637.8742 1657.6321 3061.9883 3062.0574 3063.3722 3064.8336 3065.4587 3072.7825 3136.4314 3138.2173 3141.8350 3149.2173 3150.2529 3152.0885 3155.9453 3157.3031 3158.0187 3176.7801 3189.6319 3194.3902 3201.2633 3210.8771 3220.1291
redmass: 3.1371 4.6249 4.7644 3.0384 7.1287 4.8206 4.3690 5.3714 3.6472 7.9482 3.2505 2.8961 2.8987 3.2215 4.0675 1.0826 2.4692 1.5911 1.0929 1.0872 1.2934 2.7147 2.4691 2.5417 2.8945 4.6806 3.9424 4.1263 3.0389 2.9964 3.6287 3.8489 4.2563 3.1592 6.5974 6.1672 3.9707 3.0046 6.3017 2.3487 4.1428 4.1775 1.8171 4.8642 1.9562 1.1611 4.7433 3.5749 1.3986 1.2417 1.2465 1.4760 2.0703 1.7194 1.8696 1.4585 1.3810 1.2974 1.4803 1.3116 2.1475 2.5156 1.9464 3.3553 1.6769 1.3200 1.1447 1.8812 2.4286 2.2755 2.9406 1.6868 1.2082 1.2079 1.2744 3.1020 1.2672 1.2058 2.1138 1.0526 1.0482 1.0480 1.1598 1.0481 1.0483 1.1273 1.0592 1.0426 2.4372 1.3243 1.7742 1.1256 4.1864 4.6204 6.1121 6.4292 1.0649 1.0353 1.0326 1.0322 1.0408 1.0402 1.0974 1.0971 1.0971 1.1044 1.1048 1.1050 1.1043 1.1044 1.1038 1.1041 1.1030 1.0864 1.0897 1.0932 1.0974
irintensity: 855.3896 6.0196 3.9620 0.1854 1.0655 3.8704 1.6198 2.9259 0.6265 2.1585 2.0059 0.3624 0.5854 0.8507 0.4973 0.1137 5.5642 3.2713 0.0939 0.0649 13.4090 12.0082 0.8024 0.5310 0.2200 3.9084 10.3831 8.1853 0.3494 2.4370 18.7947 16.3160 3.8441 16.6907 34.0270 28.2297 22.9305 16.3963 38.5491 20.3655 11.3609 15.1396 20.9550 2.2356 47.6591 0.0141 9.7838 0.4206 5.1565 8.4423 7.6126 0.1645 22.3204 12.9950 13.6373 50.5466 51.2034 2.0840 241.9665 1.0861 6.7166 11.6021 6.6048 10.8250 75.4364 1.8529 3.6996 23.9181 12.4546 22.0967 10.8449 3.5316 9.4263 9.9798 0.7060 7.8651 24.9083 9.9671 15.6109 0.1390 0.3638 0.2222 11.8070 18.3130 20.2113 7.0060 3.3177 10.7671 18.6428 14.3126 11.5128 41.2180 78.6837 45.9150 0.4338 0.2999 11.0289 6.2175 3.4814 3.3582 0.1973 1.7116 1.3088 6.4989 5.2146 13.8221 3.1796 1.0036 3.2225 4.1649 0.8319 5.2745 4.6599 3.1481 8.3653 32.7107 30.2292
temp: 298.150 k
press: 1.00000 atm
elementType: 6 6 6 6 1 1 6 6 6 1 1 6 1 6 6 1 1 1 6 1 1 1 15 6 1 1 1 6 1 1 1 6 1 1 1 79 6 1 6 1 35
symmnumber: 1
zpe: 870803.8 jmol-1
zpe.correction: 0.331672 hartree
zpe.thermalcorrener: 0.354543 hartree
zpe.thermalcorrenthalpy: 0.355487 hartree
zpe.thermalcorrgfe: 0.277583 hartree
zpe.sumelectzpe: -1112.794623 hartree
zpe.sumelectthermal: -1112.771751 hartree
zpe.sumelectthermalent: -1112.770807 hartree
zpe.sumelectthermalfe: -1112.848712 hartree
dipole: 1.4532 4.7467 1.0768
dipole: 5.0796
quadrupole: -128.0107 -34.2973 -140.3655
quadrupole: -10.0387 -3.9093 -0.3188
quadrupole: -27.1195 66.5939 -39.4744 -10.0387 -3.9093 -0.3188
hfenergy: -1113.1262947 hartree
pointgroup: C01 [X(C16H22Au1Br1P1)]
dipole: -0.4678099 1.2779992 0.2745596 debye
polarizability: 385.4822457|3.6772814|392.1687925|-1.2004354|-14.6223108|214.5087036 unknown
InChI: InChI=1/C13H13Br.C3H9P.Au/c1-12(2)13(15-12)7-9-5-3-4-6-10(9)11(13)8-14;1-4(2)3;/h3-6H,7H2,1-2H3;1-3H3;/rC16H22AuBrP/c1-15(2)16(20-15)10-11-8-6-7-9-12(11)13(16)14(18)17-19(3,4)5/h6-9H,10H2,1-5H3
charge 1 multiplicity 1
41 atoms
C  2.247755 2.732751 -0.44685
C  1.665951 1.592919 0.134313
C  2.475869 0.564086 0.621846
C  4.434986 1.80073 -0.122678
H  2.040497 -0.301809 1.110208
H  5.514411 1.872266 -0.217647
C  0.183168 1.726776 0.096128
C  -0.684835 0.690899 -0.050751
C  1.188896 3.740963 -0.848099
H  1.00138 3.727375 -1.929616
H  1.439274 4.76386 -0.559377
C  -0.011515 3.193615 -0.082429
H  -1.235205 3.409081 -0.607999
C  -0.975043 4.013326 0.53736
C  -0.991897 5.50344 0.292394
H  -0.592668 5.786363 -0.682571
H  -2.00989 5.888968 0.387986
H  -0.379133 5.975715 1.070161
C  -1.883447 3.512228 1.627261
H  -1.752822 4.193994 2.475787
H  -2.933197 3.561947 1.324938
H  -1.643352 2.496309 1.939618
P  0.178619 -3.630903 0.041616
C  -0.985486 -4.631836 1.0483
H  -0.687628 -5.685363 1.037149
H  -0.985422 -4.263973 2.078284
H  -1.99547 -4.534643 0.640234
C  1.835719 -3.999057 0.740726
H  2.02195 -5.077866 0.736248
H  2.601468 -3.493599 0.145422
H  1.886167 -3.625436 1.767452
C  0.175767 -4.432829 -1.609782
H  -0.813859 -4.32605 -2.062952
H  0.911729 -3.943171 -2.253707
H  0.42194 -5.495694 -1.517482
Au -0.299962 -1.340194 -0.004458
C  3.861805 0.675935 0.483828
H  4.501391 -0.115575 0.863752
C  3.62648 2.844073 -0.587136
H  4.067463 3.726999 -1.04108
Br -2.553772 1.116866 -0.529617
