program: Gaussian 09
title: sm
version: EM64L-G09RevD.01
method: RB3LYP
basis: GenECP
operation: Freq
keyword: #P
keyword: Geom=AllCheck
keyword: Guess=TCheck
keyword: SCRF=Check
keyword: GenChk
keyword: RB3LYP/GenECP
keyword: Freq
converged: YES YES NO YES
title: Mulliken charges:
elementType: C C C C H H C C H H C H C C H H H C H C H C H Br C H H H C C C C H H C C C H H C H C C H H H C H H H C H C H Br
charge: 0.098319 0.107028 -0.188095 -0.135967 0.155989 0.153574 0.175027 -0.374739 0.200997 0.188155 -0.250313 0.213416 0.290233 -0.530622 0.225730 0.219260 0.228726 -0.139451 0.153605 -0.191033 0.154953 -0.320037 0.214579 -0.089804 -0.525000 0.224260 0.200184 0.209881 0.213560 -0.020708 -0.113936 -0.096203 0.182570 0.178025 0.425154 -0.497870 -0.414306 0.172257 0.173336 -0.181492 0.131825 0.195557 -0.520218 0.164626 0.166665 0.156255 -0.512796 0.160996 0.160723 0.158574 -0.143866 0.174681 -0.193898 0.168287 0.043345
chargesum: 1.00000
title: Mulliken charges with hydrogens summed into heavy atoms:
elementType: C C C C C C C C C C C C Br C C C C C C C C C C C C C C Br
charge: 0.098319 0.107028 -0.032106 0.017607 0.175027 0.014413 -0.036896 0.290233 0.143093 0.014155 -0.036079 -0.105458 -0.089804 0.109324 0.213560 -0.020708 0.068634 0.081822 0.425154 -0.497870 -0.068713 -0.049667 0.195557 -0.032673 -0.032503 0.030815 -0.025611 0.043345
polarizability: 5.38668236e+02 -3.03076821e+01 4.09391113e+02 1.74248698e+02 2.35064637e+01 4.06499516e+02
1716.lowfreq: -1060.8459 -3.1363 0.0005 0.0006 0.0006 5.6067 9.2170 14.5905 20.8965
frequency: -1060.8458 14.1210 19.8869 23.1218 28.1317 36.9596 42.4356 50.2871 56.7525 65.1113 79.3561 83.4746 88.3134 109.7186 111.2076 144.0680 152.2527 167.0186 180.3328 191.9334 203.5545 205.4287 221.5209 231.4792 252.1984 257.8798 276.1472 299.9680 316.6163 336.2814 392.0552 402.0457 409.9445 425.5314 442.9885 455.7096 462.0713 471.1024 496.3628 515.3392 536.2532 541.0977 560.3739 581.8730 587.3446 589.0797 611.7552 623.8961 658.7918 691.1062 715.3365 732.9299 745.2210 752.7995 769.2364 777.4013 784.5796 791.2047 794.5094 817.4218 836.6336 852.8454 863.1501 879.7615 886.3819 902.7420 917.2822 951.3391 960.7550 964.6756 976.6431 978.5856 979.1463 994.5651 996.3635 1014.9205 1024.6129 1031.0500 1038.7386 1055.7704 1060.0474 1069.0163 1085.6349 1116.4241 1125.1774 1129.2236 1135.8981 1186.2790 1191.5565 1199.5389 1207.1839 1209.7977 1218.0899 1252.0918 1256.0441 1260.0728 1271.4620 1275.9875 1278.4513 1281.1930 1313.8082 1323.2241 1336.1145 1341.0383 1348.4078 1370.3839 1381.3807 1388.6620 1401.1811 1414.4414 1429.5415 1437.9536 1446.0790 1484.3096 1487.3405 1494.5315 1502.3879 1506.1058 1508.7789 1509.3693 1512.1653 1512.9711 1516.3808 1525.3807 1528.1426 1596.5493 1597.8830 1636.0856 1646.9357 1652.2015 1680.7202 1746.0345 2087.4695 3027.3476 3036.3474 3037.1735 3056.9051 3068.4436 3073.5171 3074.7915 3080.8363 3101.4955 3110.1123 3122.2388 3125.3656 3135.5696 3141.3911 3150.1735 3166.4175 3195.2306 3201.0505 3202.1914 3210.7043 3214.3809 3221.5949 3222.2652 3224.2711 3234.7911 3246.9096
redmass: 1.2889 6.6743 4.8483 6.3690 3.6422 5.2541 4.8056 17.5209 4.2806 5.3004 4.1539 4.3758 4.2211 3.8910 4.3607 3.8404 1.1001 3.3683 1.5490 1.2528 3.5313 3.7359 3.0845 2.7770 4.7386 2.6534 4.4566 5.2549 3.3137 3.5406 3.9212 2.4659 2.4068 3.1047 3.8080 2.9178 2.4058 3.7224 2.9573 3.7271 4.0926 4.6770 3.1205 3.2074 4.5801 5.5379 5.9115 4.9769 4.0753 3.7453 3.0565 1.7369 3.1502 2.1864 1.4015 2.4193 2.0829 2.4419 2.1594 2.0069 3.0499 3.0380 3.8879 1.5065 1.4105 1.7781 1.2603 1.4368 1.8482 2.2451 1.3867 2.2998 1.4161 1.4956 1.6453 1.3422 1.2754 2.4088 1.7385 1.7665 2.0030 2.2630 2.0697 1.6677 2.1689 2.2448 1.8688 1.1653 1.3583 1.1324 1.1570 1.9231 2.0347 1.5634 2.0703 1.2349 1.6487 1.2964 1.3152 2.8954 1.6237 2.5445 1.5193 1.6187 1.1168 3.4803 3.1903 1.7897 1.2949 1.3572 1.3244 1.3249 1.2367 1.0597 2.2035 1.0468 1.1282 1.4594 1.8427 1.8074 1.1156 1.0659 1.1851 1.9365 1.0967 2.5530 4.4793 6.1642 5.2923 6.1464 9.1622 6.2590 9.8504 1.0383 1.0407 1.0457 1.0665 1.0651 1.0843 1.1002 1.0998 1.0896 1.0983 1.1007 1.0977 1.0554 1.0953 1.0901 1.1029 1.0862 1.0891 1.0883 1.0935 1.0908 1.0973 1.0922 1.1143 1.0977 1.0932
irintensity: 15058.6213 0.3640 0.1537 0.0446 0.3426 1.0560 2.0867 0.0888 0.1154 0.4822 0.7156 1.1025 2.6362 2.6150 0.9416 2.7569 0.9158 8.9778 4.8923 5.2935 2.6277 2.5023 0.6115 8.6889 6.8807 18.8335 1.4825 13.7673 7.5742 1.4986 9.1507 1.3326 8.9366 8.3230 11.0957 0.7710 1.1960 23.8134 4.6339 96.8305 3.9165 7.4548 0.9497 3.7490 15.9838 6.4966 12.7012 29.7613 2.7977 242.0946 4.0597 100.5063 29.9193 3.4869 86.1742 12.0043 116.8208 43.9515 19.2890 4.7762 15.7356 14.4871 2.4525 12.2575 2.4869 6.7399 159.8563 1.1588 3.7086 10.2852 3.6210 13.2848 0.2909 0.2652 0.3682 0.5148 2.9128 0.8670 16.5961 4.0381 9.3365 0.3902 38.0019 1.4216 7.8965 2.8178 20.6280 7.6221 12.5211 2.2950 18.7857 5.1337 18.2904 27.4996 11.6011 92.9587 18.2527 8.9811 4.5085 63.8747 0.2524 17.6883 1.8032 0.5562 8.5663 37.0890 1.1896 21.6822 30.2827 67.4600 2.4792 10.7863 1.8641 16.3741 28.6256 0.4892 4.2405 8.3832 15.5462 32.2011 22.8608 24.9208 15.1052 5.3940 17.5201 62.4569 31.5424 1.6289 168.6365 2.0308 14.2815 13.1994 607.4160 38.4225 67.8330 3.3529 26.4959 24.7266 4.2808 15.9842 42.1704 4.7563 14.8083 33.0770 8.4060 6.1839 33.3169 42.1100 13.2385 3.5463 1.7088 3.9416 29.2995 8.6712 26.3377 11.1773 0.3648 20.2256 12.0719
temp: 298.150 k
press: 1.00000 atm
elementType: 6 6 6 6 1 1 6 6 1 1 6 1 6 6 1 1 1 6 1 6 1 6 1 35 6 1 1 1 6 6 6 6 1 1 6 6 6 1 1 6 1 6 6 1 1 1 6 1 1 1 6 1 6 1 35
symmnumber: 1
zpe: 1176177.5 jmol-1
zpe.correction: 0.447982 hartree
zpe.thermalcorrener: 0.476769 hartree
zpe.thermalcorrenthalpy: 0.477713 hartree
zpe.thermalcorrgfe: 0.383596 hartree
zpe.sumelectzpe: -1032.653703 hartree
zpe.sumelectthermal: -1032.624917 hartree
zpe.sumelectthermalent: -1032.623973 hartree
zpe.sumelectthermalfe: -1032.718090 hartree
dipole: 5.0393 5.4653 -3.5654
dipole: 8.2448
quadrupole: -133.5456 -151.2843 -153.7088
quadrupole: -4.5161 16.1650 -11.1029
quadrupole: 12.6340 -5.1047 -7.5292 -4.5161 16.1650 -11.1029
hfenergy: -1033.1016854 hartree
pointgroup: C01 [X(C26H27Br2)]
dipole: -1.2206047 0.0497964 -0.4041232 debye
polarizability: 538.6682362|-30.3076821|409.3911132|174.2486976|23.5064637|406.4995157 unknown
InChI: InChI=1/C26H27Br2/c1-18(2)12-13-20-8-4-5-9-21(20)15-26(28)29-17-19(3)24-14-22-10-6-7-11-23(22)25(24)16-27/h4-12,16,24H,13-14,17H2,1-3H3
charge 1 multiplicity 1
55 atoms
C  2.34071867 1.32634015 -2.70863753
C  2.12247379 -0.04477089 -2.9125233
C  3.08966722 -0.983835 -2.52978766
C  4.50608337 0.8419587 -1.78436433
H  2.9197098 -2.04727485 -2.6705636
H  5.43967389 1.17970313 -1.34424226
C  0.82297065 -0.25359524 -3.56256217
C  1.16465144 2.15858905 -3.15602001
H  1.4280342 2.87315935 -3.94153723
H  0.75416069 2.74257219 -2.32312459
C  0.12989105 1.09722833 -3.70404284
H  -0.06984238 1.30398022 -4.76152722
C  -1.16814692 1.24841567 -2.9637053
C  -1.47618045 0.48027741 -1.84622756
H  -0.9605602 -0.46926059 -1.71201714
H  -0.87051488 1.16742655 -0.87455157
H  -2.49773529 0.52257241 -1.46958263
C  4.27867083 -0.53067908 -1.96268075
H  5.03509655 -1.24596576 -1.65432036
C  3.53742165 1.77753846 -2.15517277
H  3.71283781 2.83939379 -2.00881863
C  0.34964389 -1.42242963 -4.01203102
H  0.87958695 -2.3632536 -3.93087321
Br -1.34305349 -1.59368617 -4.88738068
C  -2.05793955 2.35561033 -3.40948638
H  -2.52441621 2.04287427 -4.35597727
H  -2.84741415 2.57776431 -2.68909513
H  -1.48625483 3.26363073 -3.63371018
C  2.87842822 1.12016722 1.24054201
C  1.62228122 0.44403459 1.16701434
C  1.53000358 -0.95122476 1.42611817
C  3.90489897 -1.01005361 1.80785105
H  0.56006308 -1.43375688 1.36779934
H  4.80105383 -1.57256667 2.05278135
C  0.46241128 1.15426689 0.86646493
C  -0.57110744 1.70869683 0.43495814
C  2.97368438 2.61821702 1.0506551
H  2.32293171 2.92475777 0.22353056
H  3.99519939 2.8757455 0.76197739
C  2.55105159 3.34071926 2.3144335
H  1.47395056 3.35708149 2.48245203
C  3.34568582 3.90330133 3.23724884
C  4.85309995 3.92986744 3.18077128
H  5.22227535 4.96123648 3.25643353
H  5.27247653 3.38539151 4.03778482
H  5.26701523 3.48842904 2.27104733
C  2.75624095 4.56894028 4.45828283
H  3.127895 4.09345309 5.3765349
H  3.05693108 5.62428287 4.51086687
H  1.66264388 4.52299693 4.46733635
C  2.67006592 -1.6731006 1.73024112
H  2.60914766 -2.74069516 1.91328092
C  4.00034453 0.36341392 1.57681718
H  4.96619985 0.85390426 1.64968546
Br -1.94583591 2.85502459 0.91478874
