program: Gaussian 09
title: opt freq
version: EM64L-G09RevD.01
method: RB3LYP
basis: GenECP
operation: Freq
keyword: #P
keyword: Geom=AllCheck
keyword: Guess=TCheck
keyword: SCRF=Check
keyword: GenChk
keyword: RB3LYP/GenECP
keyword: Freq
converged: YES YES YES YES
title: Mulliken charges:
elementType: C C C C H H C C C H H C H C C H H H C H H H P C H H H C H H H C H H H Au C H C H C H H H
charge: 0.166841 0.089912 -0.174174 -0.116344 0.205934 0.174197 -0.155035 0.083368 -0.491879 0.234260 0.235507 0.181564 0.164760 -0.168599 -0.456246 0.166522 0.167279 0.162709 -0.456763 0.168656 0.167489 0.163216 0.647569 -0.654558 0.204715 0.215745 0.217132 -0.655072 0.204490 0.217030 0.215882 -0.655851 0.216088 0.216137 0.203816 -0.145989 -0.146218 0.168791 -0.183106 0.166040 -0.555865 0.211512 0.168401 0.210140
chargesum: 1.00000
title: Mulliken charges with hydrogens summed into heavy atoms:
elementType: C C C C C C C C C C C P C C C Au C C C
charge: 0.166841 0.089912 0.031760 0.057853 -0.155035 0.083368 -0.022112 0.181564 -0.003839 0.040264 0.042597 0.647569 -0.016966 -0.017671 -0.019811 -0.145989 0.022573 -0.017066 0.034187
polarizability: 3.97751622e+02 5.38560618e+00 3.85375939e+02 -3.13728228e+00 2.28452756e+00 1.99208583e+02
1716.lowfreq: -3.1578 -0.0009 -0.0008 -0.0005 5.9089 8.0666 23.8406 39.0290 40.4174
frequency: 23.6027 38.8774 40.2631 51.2545 63.2766 76.7610 105.3553 112.5955 132.4349 152.6539 167.7079 170.9041 182.9364 201.0054 202.3823 208.8619 215.0960 219.2116 223.2398 239.7078 248.5418 252.2140 268.9079 298.3156 341.6310 343.7808 348.4813 412.1236 428.7408 444.3420 450.8410 468.6508 574.8008 596.3769 629.2659 635.9872 667.2550 689.0482 724.0380 741.9770 743.6541 745.9063 792.5503 814.7057 822.8175 871.1589 884.5212 885.4672 897.1402 926.7647 928.6922 959.3609 981.4572 988.3763 988.6597 990.8026 997.5366 1018.3916 1031.0856 1056.9402 1065.3395 1066.3780 1121.4207 1126.4855 1151.7614 1180.8757 1201.2798 1215.4893 1237.5148 1240.1594 1271.8913 1296.9779 1352.9400 1353.5008 1367.7614 1371.4990 1372.8338 1382.6355 1389.5118 1417.3307 1429.2263 1429.9126 1441.7981 1454.3406 1476.6173 1478.2908 1478.5467 1485.4283 1488.1091 1490.2620 1496.5078 1506.3698 1507.7201 1515.2447 1517.4139 1530.1918 1533.0802 1536.0096 1573.6479 1609.5281 1654.1837 3005.5248 3022.8339 3048.3267 3058.6247 3059.7874 3062.2142 3062.8499 3062.9181 3063.3644 3108.4325 3123.5705 3125.6922 3148.5314 3149.1342 3149.2390 3149.3592 3153.2304 3157.0583 3157.9508 3159.1216 3195.7017 3200.1030 3211.9239 3212.9246 3225.8553
redmass: 3.2116 3.9208 4.3675 2.9439 3.4011 3.0172 2.4113 4.5822 5.1584 3.0969 1.5547 3.2897 3.3441 1.1872 1.0723 1.2245 1.0770 1.8457 1.1388 4.1943 2.5868 2.4583 2.4745 1.8407 3.4060 3.3574 3.2355 4.1828 2.9457 2.7077 3.4079 3.6948 3.4328 4.6237 3.8111 4.9776 4.1038 4.0110 2.6636 4.2358 4.1797 4.0423 1.5331 4.7282 1.1603 1.6080 1.2384 1.2858 2.8222 4.1932 2.2289 1.2337 1.3634 1.3864 1.4152 1.3946 1.4534 1.3387 2.1035 1.9766 1.5405 2.0678 2.4706 2.2087 1.9556 1.9500 1.2046 1.7034 1.9594 1.1437 3.9241 1.7875 1.2076 1.2086 4.2439 1.1990 1.2637 4.3051 1.3101 1.7935 1.3109 1.2383 1.3605 1.2455 1.0527 1.0480 1.0481 1.0482 1.0480 2.1531 1.0435 1.1089 1.0569 1.0486 2.8674 1.0760 1.0484 1.0638 3.5615 5.3171 5.5404 1.0632 1.0942 1.0830 1.0440 1.0369 1.0329 1.0339 1.0387 1.0330 1.1014 1.1033 1.1032 1.1047 1.1046 1.1010 1.1042 1.1000 1.1043 1.1042 1.1034 1.0885 1.0894 1.0908 1.0927 1.0974
irintensity: 1.8515 1.5744 2.2629 0.0740 0.2172 0.0482 0.0838 0.1697 0.0139 0.9677 1.4506 0.3313 0.2314 0.0184 0.0019 0.1515 0.1077 9.4860 0.7644 0.7355 0.6637 0.4150 1.7824 0.2048 1.2899 4.9639 6.0591 7.4356 6.5126 4.0975 0.3576 0.8464 0.5262 1.4417 1.1286 6.9671 10.1926 8.8499 8.6272 13.9054 11.1187 7.1127 47.6955 9.3477 0.0478 0.4642 5.6205 3.8484 10.2468 33.5687 2.2224 2.7935 0.8621 42.5246 0.0207 75.4406 263.5296 0.5454 37.4616 92.6644 0.9581 4.3637 3.9154 49.1109 40.0573 6.0533 33.6904 19.6240 20.0092 2.2886 119.0992 18.0685 9.2469 6.5250 436.0820 0.4380 2.2721 110.8708 71.5913 26.6539 24.7958 12.8370 34.3117 4.4086 0.1880 0.0677 0.1035 18.0258 20.5085 112.0736 9.6712 14.9291 3.6760 0.4643 34.6026 20.1862 14.6992 15.8391 355.3810 135.8080 94.8279 4.8993 0.1164 24.0929 17.3688 37.9706 8.4093 13.2182 30.1381 3.6761 11.0140 27.0192 37.5234 3.0351 1.1060 29.1792 11.9807 43.1857 3.8119 4.6207 0.2335 7.5881 0.4033 31.1058 20.2812 31.5353
temp: 298.150 k
press: 1.00000 atm
elementType: 6 6 6 6 1 1 6 6 6 1 1 6 1 6 6 1 1 1 6 1 1 1 15 6 1 1 1 6 1 1 1 6 1 1 1 79 6 1 6 1 6 1 1 1
symmnumber: 1
zpe: 990566.1 jmol-1
zpe.correction: 0.377287 hartree
zpe.thermalcorrener: 0.400313 hartree
zpe.thermalcorrenthalpy: 0.401258 hartree
zpe.thermalcorrgfe: 0.323599 hartree
zpe.sumelectzpe: -1139.554147 hartree
zpe.sumelectthermal: -1139.531121 hartree
zpe.sumelectthermalent: -1139.530177 hartree
zpe.sumelectthermalfe: -1139.607835 hartree
dipole: 0.1911 -0.3852 -0.1540
dipole: 0.4567
quadrupole: -54.8185 -108.8072 -136.3008
quadrupole: -5.0878 -0.9311 0.4408
quadrupole: 45.1570 -8.8317 -36.3253 -5.0878 -0.9311 0.4408
hfenergy: -1139.9314341 hartree
pointgroup: C01 [X(C17H25Au1P1)]
dipole: -0.7445814 -0.082757 -0.0332833 debye
polarizability: 397.7516223|5.3856062|385.3759389|-3.1372823|2.2845276|199.2085834 unknown
InChI: InChI=1/C14H16.C3H9P.Au/c1-10(2)14-9-13-7-5-4-6-12(13)8-11(14)3;1-4(2)3;/h4-7,10H,9H2,1-3H3;1-3H3;/rC17H25AuP/c1-12(2)16-11-14-9-7-8-10-15(14)17(13(16)3)18-19(4,5)6/h7-10,12H,11H2,1-6H3
charge 1 multiplicity 1
44 atoms
C  2.88602784 -1.69631319 -0.06903265
C  1.47843364 -1.51502654 -0.0307186
C  0.65136664 -2.67277 -0.02468213
C  2.59619388 -4.09723221 -0.08710871
H  -0.42627742 -2.54436683 0.00406458
H  3.02887342 -5.09312426 -0.10816258
C  0.91001085 -0.19264433 0.00589739
C  1.75384323 0.97262762 0.02917972
C  3.767497 -0.49853276 -0.08896547
H  4.49759121 -0.55989954 0.73560748
H  4.40548463 -0.5268004 -0.98862631
C  3.13106572 0.84579974 -0.0313221
H  5.12754153 1.49804809 -0.14281743
C  4.14588706 1.97955147 -0.05418821
C  4.01384176 2.88750908 -1.29644194
H  4.86006958 3.58248657 -1.31977369
H  3.09487099 3.47787035 -1.29674651
H  4.03626052 2.29418077 -2.21695318
C  4.19102493 2.77192173 1.27142582
H  3.28425681 3.35451644 1.44981382
H  5.0367025 3.46733487 1.24041329
H  4.33520013 2.09983301 2.12409671
P  -3.49963495 0.33831644 0.0075364
C  -4.13791709 1.16507802 1.51793365
H  -5.22526339 1.27745318 1.45724246
H  -3.67504742 2.1512781 1.61521692
H  -3.88198307 0.56810991 2.39779724
C  -4.11408972 1.37588471 -1.37757501
H  -5.20147835 1.48687368 -1.31429006
H  -3.85088309 0.90758562 -2.33020269
H  -3.644493 2.36251596 -1.32953944
C  -4.46595934 -1.21840731 -0.11424382
H  -4.22255568 -1.86597113 0.7329781
H  -4.204699 -1.73818096 -1.04050547
H  -5.53898525 -1.00084744 -0.10901501
Au -1.16168561 0.04184955 0.0088531
C  1.19984924 -3.94198643 -0.05091266
H  0.55581348 -4.81562331 -0.04386201
C  3.4299825 -2.98245603 -0.09689345
H  4.50898305 -3.10824615 -0.12674739
C  1.0545274 2.31883023 0.10345305
H  0.37804999 2.34439314 0.96474753
H  1.73601589 3.15978474 0.19704946
H  0.44565173 2.48043933 -0.79362153
