program: Gaussian 09
title: opt freq
version: EM64L-G09RevD.01
method: RB3LYP
basis: GenECP
operation: Freq
keyword: #P
keyword: Geom=AllCheck
keyword: Guess=TCheck
keyword: SCRF=Check
keyword: GenChk
keyword: RB3LYP/GenECP
keyword: Freq
converged: YES YES YES YES
title: Mulliken charges:
elementType: C C C C H H C C C H C C H H H C H H H P C H H H C H H H C H H H Au C H C H C H Cl
charge: 0.090089 0.062904 -0.207752 -0.152672 0.185564 0.132639 0.094189 -0.399585 -0.255269 0.135364 0.110527 -0.446755 0.139715 0.139892 0.162503 -0.455889 0.143508 0.144397 0.146276 0.651430 -0.654770 0.198774 0.214849 0.215054 -0.658130 0.199543 0.214800 0.215307 -0.653114 0.214836 0.214726 0.198829 -0.157687 -0.165585 0.132066 -0.211258 0.133011 -0.136808 0.150527 -0.086046
chargesum: 0.00000
title: Mulliken charges with hydrogens summed into heavy atoms:
elementType: C C C C C C C C C C P C C C Au C C C Cl
charge: 0.090089 0.062904 -0.022188 -0.020033 0.094189 -0.399585 -0.119905 0.110527 -0.004646 -0.021708 0.651430 -0.026093 -0.028479 -0.024724 -0.157687 -0.033519 -0.078247 0.013719 -0.086046
polarizability: 4.06865693e+02 2.27049655e+01 3.93529385e+02 4.73169097e+00 -5.19004729e+00 1.90435819e+02
1716.lowfreq: -2.5154 -0.0013 -0.0010 0.0021 2.7551 7.4833 17.1164 32.2695 36.0163
frequency: 16.9629 31.0268 35.3511 44.8010 56.1198 96.1911 103.5724 121.0208 129.7197 155.4865 165.5630 180.1380 191.5091 198.2146 208.8524 216.2735 227.1575 231.0447 249.0912 252.4966 256.5338 275.1829 296.9219 301.2472 326.3123 344.0172 374.1028 427.4089 447.2130 470.6596 515.4802 575.6599 582.3119 607.5168 648.3304 668.0394 720.2818 731.1957 740.2818 743.2285 760.6746 789.1425 811.2659 819.7533 855.6321 864.4052 883.6813 884.7554 893.1904 896.8352 935.9391 937.9844 952.9177 974.6367 981.5666 988.1630 990.5750 999.6874 1057.1419 1103.4647 1118.7446 1127.9958 1152.3847 1189.2492 1207.1009 1221.6219 1240.1850 1301.3268 1329.5278 1345.8970 1351.3203 1352.0185 1372.0638 1395.9843 1399.4263 1424.4431 1442.3058 1474.4099 1478.4854 1478.9689 1486.8735 1487.7255 1496.7100 1498.0401 1500.8813 1512.7254 1516.6163 1528.8473 1538.1773 1580.4390 1608.8436 1640.8832 1654.9457 3039.5761 3044.7795 3060.3645 3061.4423 3062.3143 3084.1628 3102.5128 3114.2859 3116.7174 3135.4771 3147.0109 3147.8474 3148.8959 3153.9211 3155.6737 3156.1134 3174.6918 3182.0475 3191.1771 3204.7965 3236.7294
redmass: 4.6791 3.1916 4.4471 5.0222 4.8408 4.6173 4.8699 3.5781 4.1295 3.3231 3.3657 3.4510 1.0376 4.4895 1.1141 4.3860 1.1178 3.8148 2.5646 2.2911 1.3920 3.7741 3.8951 1.4085 2.4221 3.8754 4.1837 2.9065 4.1697 3.8045 4.3647 3.8626 3.7458 8.3588 4.6313 4.1086 3.0974 7.6097 4.1599 4.1969 1.5327 3.3608 5.0891 1.1614 3.3440 1.4908 1.2380 1.2454 3.5947 1.6583 3.3818 1.4368 1.2383 1.2557 1.4368 1.3853 1.3824 1.4701 2.1690 1.6624 2.6092 2.0332 2.1653 1.2234 1.9474 1.6308 2.0405 2.3938 1.9338 1.3420 1.2092 1.2093 1.1972 4.2493 1.5903 1.2588 1.2258 1.0533 1.0485 1.0483 1.0485 1.0490 2.3698 1.1176 2.4641 1.0427 1.0550 1.0438 1.0601 10.3480 5.5837 6.1196 6.4029 1.0362 1.0362 1.0329 1.0328 1.0325 1.0860 1.1030 1.0989 1.1028 1.0996 1.1043 1.1046 1.1050 1.1041 1.1041 1.1038 1.0854 1.0881 1.0925 1.0970 1.0935
irintensity: 2.5843 0.2744 2.4626 0.0047 0.4949 0.8369 1.0247 0.4666 1.9566 1.1400 0.8227 0.0939 0.0641 6.1996 0.2109 0.9560 0.1079 2.1846 0.7980 2.5066 1.5910 2.9797 10.5271 3.6410 2.8339 10.0212 2.8610 2.2839 0.9448 2.0779 2.0318 1.7490 2.7111 52.2858 40.9949 9.9566 25.6972 120.2358 18.9572 19.1833 33.8106 7.2540 3.3062 0.0075 12.2010 7.9049 7.6567 10.1521 4.5315 13.2923 9.2622 4.7875 3.7685 0.3088 0.5882 44.3019 46.8048 259.4212 10.3380 25.5872 5.9380 2.4864 8.0265 2.5936 14.8860 1.6312 19.6590 10.4130 9.9409 1.1999 9.3232 10.0170 0.1374 39.7598 4.8770 3.8668 8.6112 0.1543 0.1452 0.3492 19.3848 17.7108 85.0609 22.2924 6.7297 2.1509 2.4007 7.3847 2.1636 191.0412 10.2359 3.0240 15.9980 38.2749 58.1932 13.5218 4.7166 4.1678 3.1513 4.8318 114.0181 48.3574 43.7068 15.3819 7.3864 0.6174 3.7782 4.5625 1.4243 6.4766 4.3725 61.6232 70.7108 23.2370
temp: 298.150 k
press: 1.00000 atm
elementType: 6 6 6 6 1 1 6 6 6 1 6 6 1 1 1 6 1 1 1 15 6 1 1 1 6 1 1 1 6 1 1 1 79 6 1 6 1 6 1 17
symmnumber: 1
zpe: 858438.1 jmol-1
zpe.correction: 0.326962 hartree
zpe.thermalcorrener: 0.349396 hartree
zpe.thermalcorrenthalpy: 0.350340 hartree
zpe.thermalcorrgfe: 0.273030 hartree
zpe.sumelectzpe: -1559.435456 hartree
zpe.sumelectthermal: -1559.413022 hartree
zpe.sumelectthermalent: -1559.412078 hartree
zpe.sumelectthermalfe: -1559.489388 hartree
dipole: 2.0122 -10.3604 0.4225
dipole: 10.5624
quadrupole: -146.4977 -102.0931 -147.6682
quadrupole: -2.8751 -0.1329 -0.4736
quadrupole: -14.4114 29.9932 -15.5819 -2.8751 -0.1329 -0.4736
hfenergy: -1559.7624179 hartree
pointgroup: C01 [X(C16H21Au1Cl1P1)]
dipole: 0.7916571 -4.0760783 0.1662378 debye
polarizability: 406.8656927|22.7049655|393.5293847|4.731691|-5.1900473|190.4358186 unknown
InChI: InChI=1/C13H12Cl.C3H9P.Au/c1-9(2)12-7-10-5-3-4-6-11(10)13(12)8-14;1-4(2)3;/h3-7,9H,1-2H3;1-3H3;/rC16H21AuClP/c1-11(2)14-10-12-8-6-7-9-13(12)15(14)16(18)17-19(3,4)5/h6-11H,1-5H3
charge 0 multiplicity 1
40 atoms
C  1.98495611 3.06126961 -0.10590835
C  1.46044548 1.74602187 -0.03755723
C  2.34306568 0.67100953 0.0649343
C  4.23222113 2.20954707 0.0236004
H  1.97593948 -0.34950188 0.12525652
H  5.30625542 2.37479881 0.04862488
C  -0.03417636 1.85252448 -0.10560843
C  -0.82910129 0.74789542 -0.14364853
C  0.86938921 3.98649621 -0.19001313
H  0.98808215 5.06212386 -0.24318535
C  -0.31926485 3.32192694 -0.17677731
C  -2.25853995 3.96731282 1.27680408
H  -1.62789925 4.55068188 1.95900172
H  -3.2678218 4.39645546 1.29058692
H  -2.31721745 2.94416043 1.65847524
C  -1.60764311 5.46232846 -0.64813717
H  -2.61909505 5.88192154 -0.6930789
H  -1.01925922 6.09725483 0.02516146
H  -1.16446784 5.52565226 -1.64813451
P  0.08575471 -3.56899852 0.00225204
C  -1.07550769 -4.56201877 1.02225682
H  -0.78401618 -5.61754064 1.01578682
H  -1.06733411 -4.18791639 2.0500236
H  -2.08813499 -4.46158139 0.62135376
C  1.74423513 -3.95127946 0.69381568
H  1.92125297 -5.03177267 0.69576136
H  2.51151961 -3.45681867 0.09101188
H  1.80554581 -3.57065423 1.7173915
C  0.07104864 -4.39264955 -1.64000377
H  -0.91916926 -4.28297766 -2.091379
H  0.80748224 -3.91499748 -2.29254753
H  0.30966133 -5.45649732 -1.53819062
Au -0.38619799 -1.27528092 -0.07028048
C  3.72455532 0.90748591 0.09643421
H  4.40647287 0.06511885 0.18051068
C  3.36007668 3.29819242 -0.07891076
H  3.74398881 4.31403288 -0.13399982
C  -1.6683807 4.00910999 -0.14989879
H  -2.3506802 3.46891682 -0.81190242
Cl -2.6268674 0.96360756 -0.30693523
