program: Gaussian 09
title: opt freq
version: EM64L-G09RevD.01
method: RB3LYP
basis: GenECP
operation: Freq
keyword: #P
keyword: Geom=AllCheck
keyword: Guess=TCheck
keyword: SCRF=Check
keyword: GenChk
keyword: RB3LYP/GenECP
keyword: Freq
converged: YES YES YES YES
title: Mulliken charges:
elementType: C C C C H H C C C H H C H C C H H H C H H H P C H H H C H H H C H H H Au C H C H Cl
charge: 0.104993 0.092964 -0.193259 -0.139981 0.192267 0.155329 0.093102 -0.310784 -0.441912 0.230974 0.227725 0.176793 0.185712 -0.171804 -0.467032 0.169429 0.172246 0.167279 -0.456490 0.169010 0.179526 0.178288 0.657189 -0.656268 0.208435 0.219564 0.220450 -0.658596 0.208580 0.221127 0.218875 -0.654904 0.219863 0.220125 0.208300 -0.015612 -0.151692 0.155531 -0.189929 0.155994 0.098592
chargesum: 1.00000
title: Mulliken charges with hydrogens summed into heavy atoms:
elementType: C C C C C C C C C C C P C C C Au C C Cl
charge: 0.104993 0.092964 -0.000992 0.015348 0.093102 -0.310784 0.016787 0.176793 0.013908 0.041922 0.070334 0.657189 -0.007819 -0.010014 -0.006615 -0.015612 0.003839 -0.033934 0.098592
polarizability: 3.55934184e+02 1.85287633e+00 4.08716410e+02 -9.35322374e+00 -2.85973627e+01 2.08040166e+02
1716.lowfreq: -0.0014 -0.0010 0.0009 3.7096 9.1011 10.8517 26.6603 27.4030 34.1381
frequency: 25.7811 27.2932 33.5410 49.5997 65.7662 78.6330 107.0280 125.4050 138.6896 152.7031 160.5500 174.7463 184.0259 193.6261 206.4025 213.2518 215.8763 222.1773 233.7562 246.7461 248.8187 252.5860 304.6668 310.4238 319.8442 348.1194 370.2191 425.1067 441.3864 471.9402 502.3009 517.4248 582.6488 616.0112 634.3978 656.4072 668.4741 744.5073 745.1338 747.4923 778.3686 798.1239 806.5783 823.1034 857.7689 871.8978 885.2890 887.4977 889.2821 918.6768 939.5717 963.5016 967.5864 988.8926 989.7539 993.5730 998.9034 1001.6295 1053.6148 1060.9205 1100.6978 1126.4374 1173.6273 1178.0695 1199.9414 1208.6746 1217.6449 1253.0536 1265.7466 1309.6568 1336.5174 1353.4779 1355.3888 1362.2064 1374.0373 1378.0662 1406.7184 1417.3887 1432.0677 1453.4279 1471.6183 1477.0356 1477.3390 1485.1487 1485.4783 1488.6280 1496.3385 1510.7760 1511.9825 1515.5520 1526.2013 1534.6456 1540.8588 1638.7510 1662.3431 3037.7083 3060.5423 3062.9298 3063.9636 3064.5018 3065.2317 3066.7767 3095.0138 3133.3709 3134.6513 3139.1698 3151.5427 3152.7119 3153.7187 3154.2484 3159.4136 3160.7580 3161.6447 3193.8963 3200.9018 3209.7274 3219.8907
redmass: 3.9042 4.5905 3.4689 6.9908 4.1542 4.6991 3.2797 4.8312 4.5750 3.2784 3.2560 1.2025 2.5785 3.1845 4.1046 1.1295 1.1054 3.9315 2.4957 1.9773 1.3951 2.4402 2.0332 1.8191 2.8751 3.8496 5.1950 3.0145 2.9310 3.8631 4.8538 3.1154 3.9041 5.7197 4.1470 4.9045 4.1237 4.1504 4.0436 1.9269 2.1091 4.1618 7.1801 1.1630 4.9332 3.0573 1.4729 1.2615 1.2388 2.3769 3.0622 1.4088 1.3760 1.4275 1.3871 1.3876 1.2838 1.4559 1.5901 2.2030 2.3131 2.4859 1.8427 1.2315 1.1602 1.9606 2.2413 2.2849 2.7829 1.2938 1.8151 1.2085 1.2069 1.9521 1.2176 3.9670 2.0003 1.2559 1.4515 1.2235 1.0529 1.0477 1.0475 1.0478 1.0484 2.4072 1.0458 1.8052 1.2091 1.0717 2.6040 1.0451 1.1428 6.1787 6.3670 1.0623 1.0355 1.0349 1.0956 1.0327 1.0327 1.0325 1.0827 1.1034 1.1036 1.1023 1.1049 1.1043 1.1048 1.1031 1.1043 1.1045 1.1037 1.0863 1.0894 1.0934 1.0973
irintensity: 1.3701 2.3062 0.9920 1.8882 0.0325 0.1082 0.2646 0.0622 0.0625 1.1359 1.1414 0.1025 0.0655 0.4733 1.2783 0.1704 0.0668 1.4999 5.3403 0.6611 1.2481 0.5003 4.0555 1.6604 0.8358 18.0114 1.5955 2.8849 8.0607 7.0092 5.3108 6.5489 2.4478 22.9648 7.6271 36.1300 12.4080 10.5313 15.1652 31.8199 25.2651 63.0625 106.6287 0.1127 37.3517 45.1354 21.4961 13.8827 6.7601 2.3282 16.4189 5.9915 14.1128 18.5232 44.1448 59.1067 9.0699 275.9783 30.9506 3.5064 37.4606 16.6006 7.4395 20.2711 6.5351 27.6570 5.7113 25.1127 23.2730 35.2840 2.2641 9.2660 9.8013 241.8114 1.4178 138.7897 243.6445 28.4508 4.0948 5.5307 0.9086 0.1057 0.1981 19.8369 22.6779 388.6946 19.5539 11.1242 18.6822 0.9142 159.2646 13.0593 37.4419 4.6664 3.2535 13.3009 22.4494 41.7148 0.5611 3.2497 7.0770 2.3165 3.0459 20.9664 10.8735 49.2240 1.1518 11.0344 0.6531 23.3429 2.1919 3.2048 0.6071 3.2784 7.1618 35.9632 28.1455
temp: 298.150 k
press: 1.00000 atm
elementType: 6 6 6 6 1 1 6 6 6 1 1 6 1 6 6 1 1 1 6 1 1 1 15 6 1 1 1 6 1 1 1 6 1 1 1 79 6 1 6 1 17
symmnumber: 1
zpe: 890056.9 jmol-1
zpe.correction: 0.339005 hartree
zpe.thermalcorrener: 0.361627 hartree
zpe.thermalcorrenthalpy: 0.362572 hartree
zpe.thermalcorrgfe: 0.285191 hartree
zpe.sumelectzpe: -1559.847801 hartree
zpe.sumelectthermal: -1559.825179 hartree
zpe.sumelectthermalent: -1559.824235 hartree
zpe.sumelectthermalfe: -1559.901616 hartree
dipole: 0.6142 -1.3368 -0.5253
dipole: 1.5621
quadrupole: -123.6522 -59.5424 -139.0947
quadrupole: -6.0705 0.3444 -0.0204
quadrupole: -16.2224 47.8874 -31.6649 -6.0705 0.3444 -0.0204
hfenergy: -1560.1868062 hartree
pointgroup: C01 [X(C16H22Au1Cl1P1)]
dipole: -0.0450113 -1.3409063 -0.7583331 debye
polarizability: 355.934184|1.8528763|408.7164099|-9.3532237|-28.5973627|208.0401662 unknown
InChI: InChI=1/C13H13Cl.C3H9P.Au/c1-9(2)12-7-10-5-3-4-6-11(10)13(12)8-14;1-4(2)3;/h3-6,9H,7H2,1-2H3;1-3H3;/rC16H22AuClP/c1-11(2)14-10-12-8-6-7-9-13(12)15(14)16(18)17-19(3,4)5/h6-9,11H,10H2,1-5H3
charge 1 multiplicity 1
41 atoms
C  1.96582643 2.88297302 0.15081235
C  1.41666704 1.67767891 0.61473525
C  2.2548243 0.65540676 1.07216695
C  4.17976584 2.03867244 0.52030911
H  1.85137882 -0.26384271 1.48463414
H  5.25750526 2.16808854 0.48591254
C  -0.06946571 1.793429 0.58843471
C  -0.92006145 0.67950024 0.76523331
C  0.85581673 3.82295068 -0.21541211
H  0.84871982 4.08041144 -1.28431499
H  0.89416434 4.78698412 0.31360001
C  -0.4049379 3.08814593 0.1411845
H  -2.49276988 2.98454705 -0.2269213
C  -1.7335169 3.74709851 -0.03237742
C  -1.7670121 4.76875559 -1.18146228
H  -1.49073556 4.30882713 -2.13599047
H  -2.78291943 5.16417454 -1.27647064
H  -1.0972434 5.61480453 -0.99571151
C  -2.10677612 4.43016402 1.31595124
H  -1.38770401 5.21858702 1.561176
H  -3.0972172 4.88474274 1.2134555
H  -2.13525362 3.71136859 2.13855138
P  0.13634317 -3.50161852 -0.13827795
C  -0.57217993 -4.74968294 1.00392488
H  -0.26384043 -5.75525828 0.70001161
H  -0.22397194 -4.55387523 2.02191573
H  -1.66343107 -4.68150052 0.98475945
C  1.94711614 -3.79363612 -0.11235323
H  2.16718331 -4.83457521 -0.37013981
H  2.43148494 -3.12839223 -0.83286289
H  2.33646067 -3.57488185 0.88584267
C  -0.40777789 -4.02401515 -1.81024967
H  -1.49715605 -3.95745167 -1.87647085
H  0.03337467 -3.36259708 -2.56098406
H  -0.09269321 -5.05489017 -2.00117189
Au -0.4311207 -1.28323034 0.38482026
C  3.63805753 0.84406983 1.01092529
H  4.29935206 0.05710109 1.36177634
C  3.34169428 3.07435315 0.09400712
H  3.75721092 4.01040901 -0.26832822
Cl -2.56343527 0.96180814 1.24834895
