program: Gaussian 09
title: opt freq
version: EM64L-G09RevD.01
method: RB3LYP
basis: GenECP
operation: Freq
keyword: #P
keyword: Geom=AllCheck
keyword: Guess=TCheck
keyword: SCRF=Check
keyword: GenChk
keyword: RB3LYP/GenECP
keyword: Freq
converged: YES YES YES YES
title: Mulliken charges:
elementType: C C C C H H C C C H H C C H H H C H H H P C H H H C H H H C H H H Au C H C H C Cl
charge: 0.098431 0.085348 -0.202996 -0.146871 0.179378 0.136405 0.062669 -0.357723 -0.400536 0.169085 0.160836 0.022100 -0.513715 0.145333 0.160148 0.172852 -0.519150 0.158955 0.156880 0.160109 0.648041 -0.653958 0.197102 0.213069 0.213915 -0.657535 0.197886 0.214850 0.212817 -0.653011 0.213618 0.213938 0.196875 -0.200339 -0.158367 0.137556 -0.203026 0.135296 0.123825 -0.120088
chargesum: 0.00000
title: Mulliken charges with hydrogens summed into heavy atoms:
elementType: C C C C C C C C C C P C C C Au C C C Cl
charge: 0.098431 0.085348 -0.023618 -0.010467 0.062669 -0.357723 -0.070616 0.022100 -0.035383 -0.043206 0.648041 -0.029872 -0.031982 -0.028581 -0.200339 -0.020811 -0.067730 0.123825 -0.120088
polarizability: 3.71489669e+02 -3.49657548e+00 3.98328360e+02 3.32545192e+00 -1.37069616e+01 2.12701429e+02
1716.lowfreq: -4.2004 -1.8115 -0.0008 0.0016 0.0018 5.3329 22.0840 29.4875 33.5339
frequency: 21.8358 28.1366 33.2931 56.3774 68.3057 83.1730 98.0618 116.1959 136.1539 146.4631 154.5386 168.4827 183.2728 190.0248 195.0565 203.9817 209.5539 227.4146 237.1474 246.7649 255.3900 265.8094 277.5228 308.4360 344.2136 347.3949 380.2348 397.3833 433.6383 456.3919 507.9212 535.7617 563.5889 599.6318 639.2902 664.2911 667.9319 733.8148 738.7821 740.6348 742.1487 769.9385 781.9218 819.1513 834.2154 877.0416 883.3762 883.7848 884.8550 940.4678 973.0075 981.6152 983.5438 987.2103 989.9560 990.0438 999.4234 1006.6142 1056.1673 1105.6655 1114.1586 1128.4380 1149.6523 1188.4836 1192.3237 1205.7815 1238.1515 1267.9025 1292.1713 1328.5625 1351.1589 1351.2881 1371.4602 1371.7631 1432.6658 1440.7989 1474.5886 1479.2171 1479.3538 1486.6860 1488.5234 1491.6472 1498.3711 1499.2666 1501.3426 1503.1642 1509.9618 1515.4683 1521.3289 1598.6774 1631.6252 1657.7220 1728.5020 3006.4670 3023.1815 3030.3219 3059.5208 3060.5591 3061.6410 3067.3300 3077.4531 3100.4783 3142.8844 3143.5896 3145.7128 3146.7854 3147.7456 3153.9447 3154.7178 3155.1922 3178.3739 3185.2559 3196.8178 3207.4577
redmass: 4.3483 3.1148 4.7184 6.2255 4.4582 4.7058 2.8025 3.4371 1.3821 4.3289 3.2563 3.3525 3.3439 1.0959 3.4918 5.0121 1.1172 1.0778 2.5824 2.4930 2.6402 1.7558 2.3197 3.9616 3.8459 4.8026 2.9024 4.4751 2.9041 3.0494 3.8807 3.7937 4.1579 6.6096 6.1980 4.8409 4.1240 4.4308 4.1256 2.1366 4.1585 5.4131 2.1506 1.1611 4.7361 1.6119 1.2404 1.2581 2.7456 1.4224 1.8962 1.2551 1.4225 1.3866 2.3240 1.4134 1.4917 1.4066 2.1607 2.8180 1.8184 3.4181 1.6667 1.2146 1.1301 2.1933 2.2102 3.1267 2.5231 1.6578 1.2098 1.2091 2.5158 1.4839 1.2758 1.2152 1.0532 1.0485 1.0485 1.0488 1.0483 1.2151 1.0446 1.0667 2.4158 1.0512 1.9003 1.1093 1.0562 9.7877 5.9788 6.5176 7.6139 1.0720 1.0422 1.0418 1.0330 1.0328 1.0326 1.0989 1.0985 1.0909 1.0960 1.0979 1.1043 1.1044 1.1049 1.1042 1.1040 1.1037 1.0855 1.0890 1.0925 1.0971
irintensity: 3.2574 0.3837 3.1967 0.0784 0.4175 0.3786 1.1448 0.4492 0.8987 5.1027 1.3922 0.0942 1.3130 0.0524 1.3720 1.7346 0.0388 0.0696 6.9813 1.7955 0.3711 4.8883 5.7248 5.6031 9.4517 2.3243 3.6312 4.7786 4.4301 5.0907 7.9622 1.2907 3.4924 24.3651 39.2360 24.2107 10.5368 53.3956 13.5005 38.0922 20.9694 4.6011 30.4840 0.0033 5.1496 1.7923 9.3117 6.9048 5.4471 3.8501 4.4665 0.5776 1.1660 44.3279 20.8830 36.8642 251.8764 3.0340 8.0557 2.2890 0.4993 5.3697 31.4560 10.0802 1.4386 3.3183 6.4526 3.8773 6.9073 0.2313 9.4591 9.5899 4.9086 1.5213 3.7345 3.1734 0.1646 0.3088 0.3422 17.6040 18.6502 3.3856 11.3229 9.3559 6.8968 5.1667 18.5490 0.2402 20.5548 49.2958 2.3239 10.8582 22.4562 51.1705 32.3061 118.5871 14.3365 6.5275 4.6088 26.7625 39.4517 32.0085 36.3354 23.5243 13.9154 11.8341 0.5749 4.8477 4.4101 1.5286 8.0577 15.1452 59.3112 47.9388
temp: 298.150 k
press: 1.00000 atm
elementType: 6 6 6 6 1 1 6 6 6 1 1 6 6 1 1 1 6 1 1 1 15 6 1 1 1 6 1 1 1 6 1 1 1 79 6 1 6 1 6 17
symmnumber: 1
zpe: 855856.8 jmol-1
zpe.correction: 0.325979 hartree
zpe.thermalcorrener: 0.348697 hartree
zpe.thermalcorrenthalpy: 0.349641 hartree
zpe.thermalcorrgfe: 0.271955 hartree
zpe.sumelectzpe: -1559.429291 hartree
zpe.sumelectthermal: -1559.406572 hartree
zpe.sumelectthermalent: -1559.405628 hartree
zpe.sumelectthermalfe: -1559.483314 hartree
dipole: 3.4632 -8.5456 0.9864
dipole: 9.2733
quadrupole: -145.7360 -98.4991 -145.8014
quadrupole: -0.2812 -2.7568 -1.4703
quadrupole: -15.7238 31.5130 -15.7892 -0.2812 -2.7568 -1.4703
hfenergy: -1559.7552696 hartree
pointgroup: C01 [X(C16H21Au1Cl1P1)]
dipole: 1.3625164 -3.3620991 0.3880605 debye
polarizability: 371.4896688|-3.4965755|398.3283599|3.3254519|-13.7069616|212.7014287 unknown
InChI: InChI=1/C13H12Cl.C3H9P.Au/c1-9(2)12-7-10-5-3-4-6-11(10)13(12)8-14;1-4(2)3;/h3-6H,7H2,1-2H3;1-3H3;/rC16H21AuClP/c1-11(2)14-10-12-8-6-7-9-13(12)15(14)16(18)17-19(3,4)5/h6-9H,10H2,1-5H3
charge 0 multiplicity 1
40 atoms
C  2.02847905 2.91792947 -0.38408502
C  1.42392927 1.76127496 0.14421493
C  2.22000035 0.7552306 0.70182648
C  4.20829279 2.03643585 0.13590644
H  1.76680768 -0.12237317 1.15331986
H  5.29042427 2.13679464 0.13810485
C  -0.05269765 1.87705922 -0.02804095
C  -0.85653666 0.80229305 -0.22903092
C  0.97606921 3.8918159 -0.87085036
H  0.91167287 3.8745934 -1.97021876
H  1.20287062 4.92140913 -0.57870406
C  -0.29549073 3.33863577 -0.22120934
C  -2.3531384 3.56504989 1.21820625
H  -2.46116668 4.25373781 2.06781769
H  -3.3339463 3.50387051 0.72923272
H  -2.10981425 2.57253748 1.60384133
C  -1.40747871 5.57339231 0.01156597
H  -2.42334382 5.81319143 -0.33183394
H  -1.24778291 6.15425313 0.9314708
H  -0.70928031 5.93381008 -0.74731507
P  0.06258743 -3.50598254 -0.05465681
C  -1.08180935 -4.51251045 0.97280027
H  -0.77787408 -5.56457745 0.96693209
H  -1.07346842 -4.13676037 2.00002662
H  -2.09770672 -4.42515262 0.57702689
C  1.72685769 -3.87124678 0.6339631
H  1.91352302 -4.9501877 0.64028528
H  2.48790315 -3.37260766 0.0268852
H  1.78808529 -3.4858473 1.6558359
C  0.05383083 -4.34312066 -1.69096131
H  -0.9381683 -4.24696096 -2.14165476
H  0.78396704 -3.86266299 -2.3485616
H  0.30345507 -5.40383815 -1.5825143
Au -0.43454481 -1.21629917 -0.13299902
C  3.61119135 0.89881962 0.69170701
H  4.23278915 0.12326993 1.1320682
C  3.41313624 3.05597072 -0.40176505
H  3.87176002 3.95030936 -0.81720403
C  -1.29489677 4.09072452 0.28219082
Cl -2.56074785 1.13308494 -0.79259579
