program: Gaussian 09
title: opt freq
version: EM64L-G09RevD.01
method: RB3LYP
basis: GenECP
operation: Freq
keyword: #P
keyword: Geom=AllCheck
keyword: Guess=TCheck
keyword: SCRF=Check
keyword: GenChk
keyword: RB3LYP/GenECP
keyword: Freq
converged: YES YES NO YES
title: Mulliken charges:
elementType: C C C C H H C C C H H C H C H H H C H H H P C H H H C H H H C H H H Au C H C H Br C O C H H C H H H C H H H
charge: 0.104645 0.101484 -0.193725 -0.141905 0.186052 0.146638 0.084427 -0.323158 -0.363551 0.186105 0.170881 -0.221698 0.170727 -0.496079 0.194986 0.180756 0.213421 -0.480325 0.216669 0.178629 0.184890 0.648652 -0.654231 0.200860 0.214000 0.215502 -0.656481 0.201089 0.216101 0.213398 -0.654382 0.215362 0.215905 0.200514 -0.153801 -0.155424 0.147542 -0.201055 0.144593 -0.157658 0.277085 -0.584402 0.113739 0.206606 0.493761 -0.508347 0.194789 0.208569 0.189530 -0.452344 0.192037 0.186412 0.182213
chargesum: 1.00000
title: Mulliken charges with hydrogens summed into heavy atoms:
elementType: C C C C C C C C C C P C C C Au C C Br C O C C C
charge: 0.104645 0.101484 -0.007674 0.004733 0.084427 -0.323158 -0.006565 -0.050971 0.093084 0.099864 0.648652 -0.023870 -0.025893 -0.022600 -0.153801 -0.007882 -0.056462 -0.157658 0.277085 -0.090641 0.320346 0.084540 0.108318
polarizability: 3.96080114e+02 1.52699392e+01 4.30663609e+02 5.76764284e+01 -1.28594616e+01 2.83304424e+02
1716.lowfreq: -8.0194 -4.1276 -0.0009 -0.0008 0.0007 4.7558 19.1289 24.1246 36.5361
frequency: 18.6972 24.0976 35.3242 39.7523 48.5166 52.8004 68.4236 78.2446 86.0299 102.9883 117.3679 120.5394 126.7370 154.8343 166.4380 181.9631 184.9261 192.2569 203.3183 206.8338 208.7520 230.8794 235.0894 246.8656 250.7196 268.6168 281.8345 286.9947 300.5298 331.9118 338.0137 343.7318 345.5363 368.4906 370.6688 402.3173 437.7731 443.6827 449.9744 475.8954 520.8069 523.7617 564.7018 581.2599 599.0867 645.1405 651.3155 667.6566 698.7932 719.0386 734.5870 738.0601 739.9025 763.2201 768.6988 792.1594 820.7364 826.7594 855.3149 883.1207 883.9017 884.4986 895.4032 939.9697 952.0282 953.2529 960.5059 970.3972 986.9152 989.7743 989.8345 997.9189 1004.9998 1027.6048 1046.0798 1052.9355 1059.1678 1113.9255 1116.2328 1143.9676 1164.8087 1190.8860 1195.7208 1196.4208 1214.4794 1235.9549 1249.1463 1276.5020 1285.3482 1305.7086 1338.6957 1348.1177 1351.9382 1352.9317 1371.9920 1374.6002 1376.8205 1383.1167 1432.3886 1442.8890 1445.8376 1455.9752 1463.6581 1474.3553 1477.2583 1477.9345 1485.7098 1486.9041 1496.4047 1502.1207 1503.1905 1505.3509 1508.1744 1511.1136 1512.1245 1520.7974 1523.0649 1528.5788 1532.0034 1539.2702 1615.8092 1633.4041 1659.7801 3054.9273 3061.3746 3062.5102 3063.0469 3063.3388 3070.7487 3075.0369 3079.3094 3087.4271 3114.7104 3134.6139 3142.5366 3147.8565 3148.4019 3149.4265 3151.2563 3152.2762 3154.7257 3155.0417 3156.1008 3156.8942 3157.5315 3166.3306 3172.7190 3180.6796 3185.8649 3192.1880 3202.4993 3213.4916 3644.7470
redmass: 5.1648 4.4977 2.9517 3.7972 5.0749 3.4833 3.9674 5.4456 3.9744 4.5598 5.5735 5.7128 4.7226 3.0727 3.2980 1.8246 1.4947 3.1600 1.1489 1.4495 2.9947 1.4893 2.0623 2.5473 2.5765 3.4630 1.1300 1.1320 2.4325 1.5816 2.8800 2.9328 2.1057 2.5000 2.9783 2.3686 3.1890 2.5639 2.4034 3.5796 3.1367 3.0441 5.7929 2.8633 5.3155 4.4212 2.8318 4.1156 7.1243 3.5376 3.3380 4.1331 4.1400 1.7739 2.2897 2.7952 1.1609 4.1826 4.0423 1.2761 1.3349 1.2533 2.5800 1.8916 1.6415 1.4191 1.4917 1.1521 1.3883 1.2736 1.3739 1.4841 1.9738 1.9785 2.6760 1.7557 2.1342 1.6125 2.2885 1.6946 1.8614 1.3687 1.1606 1.8807 1.7834 1.8991 2.1043 1.8864 2.2113 1.6112 1.8156 1.4131 1.2106 1.2111 1.1994 1.2746 2.9846 1.3309 1.1838 1.3313 1.2838 1.2053 1.2421 1.0532 1.0482 1.0484 1.0480 1.0481 1.0434 1.0747 2.2159 1.3385 1.1659 1.0568 1.3498 1.0521 1.1687 1.0718 1.0610 1.0640 9.1357 6.0593 6.6546 1.0695 1.0328 1.0328 1.0375 1.0326 1.0358 1.0815 1.0382 1.0385 1.0963 1.1000 1.1023 1.1042 1.1046 1.1048 1.1022 1.1037 1.1020 1.1042 1.1042 1.1023 1.1035 1.1033 1.0922 1.1031 1.0861 1.0892 1.0929 1.0972 1.0679
irintensity: 5.9779 5.0672 0.1364 0.9137 1.2530 0.2864 0.7059 0.4436 0.9981 0.2890 5.4476 1.4430 1.3090 2.1102 0.0965 0.6780 0.4637 0.7446 0.0401 2.7991 6.6700 1.9665 1.9493 1.1864 1.5253 6.5198 0.8144 1.6185 0.4547 0.7187 3.6674 9.8200 1.9451 9.7097 4.1112 2.2534 6.3523 22.5189 15.8278 4.8234 14.3721 17.5596 30.3047 100.7670 37.7321 176.4849 203.5863 10.9250 57.0201 23.6436 4.5929 16.3451 12.4342 34.0110 103.8200 15.8974 0.0069 10.2171 4.1158 6.8319 6.9157 6.5042 30.2857 15.0366 2.9734 4.0289 1.1018 0.8395 45.1874 5.3215 40.6395 246.9709 10.6488 8.5912 1.3353 0.9634 11.3767 149.5884 12.8420 29.5039 15.5511 12.8688 7.1708 2.3205 1.5614 22.8203 19.9574 11.6118 10.8734 9.8814 13.2767 28.5800 10.2500 9.8923 0.2537 23.2165 4.0402 15.1967 101.3899 51.1731 52.9558 11.8418 42.4363 0.2022 0.2823 0.3001 18.9357 18.5433 11.7977 6.5245 10.1553 5.0417 3.0861 9.7445 5.7095 20.9095 18.5622 6.9106 24.0178 15.6543 29.6829 0.3788 5.8191 25.2733 12.8165 4.4495 6.0115 3.8093 5.5101 28.2699 9.2864 16.3562 24.6071 6.8081 4.2735 18.3071 3.3753 0.7375 2.5030 8.7309 4.7703 4.2915 4.4436 37.9650 0.7509 6.1210 24.1277 10.1637 7.0129 9.6787 43.9812 40.8813 135.1393
temp: 298.150 k
press: 1.00000 atm
elementType: 6 6 6 6 1 1 6 6 6 1 1 6 1 6 1 1 1 6 1 1 1 15 6 1 1 1 6 1 1 1 6 1 1 1 79 6 1 6 1 35 6 8 6 1 1 6 1 1 1 6 1 1 1
symmnumber: 1
zpe: 1186316.9 jmol-1
zpe.correction: 0.451844 hartree
zpe.thermalcorrener: 0.480414 hartree
zpe.thermalcorrenthalpy: 0.481358 hartree
zpe.thermalcorrgfe: 0.390515 hartree
zpe.sumelectzpe: -1307.091433 hartree
zpe.sumelectthermal: -1307.062863 hartree
zpe.sumelectthermalent: -1307.061919 hartree
zpe.sumelectthermalfe: -1307.152762 hartree
dipole: -2.8854 13.2520 0.9289
dipole: 13.5942
quadrupole: -152.0413 6.2749 -166.1639
quadrupole: -42.0645 0.1265 -5.5933
quadrupole: -48.0645 110.2517 -62.1871 -42.0645 0.1265 -5.5933
hfenergy: -1307.5432772 hartree
pointgroup: C01 [X(C19H30Au1Br1O1P1)]
dipole: -1.2335521 3.0617502 0.7799302 debye
polarizability: 396.080114|15.2699392|430.6636088|57.6764284|-12.8594616|283.3044244 unknown
InChI: InChI=1/C16H21BrO.C3H9P.Au/c1-11(2)18-16(3,4)15-9-12-7-5-6-8-13(12)14(15)10-17;1-4(2)3;/h5-8,11,15,18H,9H2,1-4H3;1-3H3;/rC19H30AuBrOP/c1-13(2)22-19(3,4)16-12-14-10-8-9-11-15(14)17(16)18(21)20-23(5,6)7/h8-11,13,16,22H,12H2,1-7H3
charge 1 multiplicity 1
53 atoms
C  1.94232346 2.64680069 -0.4825643
C  1.27944018 1.47501698 -0.07614062
C  1.92915785 0.56210118 0.76169462
C  3.90856418 1.97471284 0.72875497
H  1.41426204 -0.32523228 1.11722101
H  4.92939087 2.16300249 1.04920187
C  -0.08810568 1.46004664 -0.65872028
C  -0.77516211 0.33592857 -0.95292291
C  1.03173143 3.49765568 -1.33808247
H  1.26215954 3.36421929 -2.40251453
H  1.11316849 4.56774577 -1.12601773
C  -0.38361449 2.91786556 -1.05237941
H  -1.02075408 2.94383972 -1.94285618
C  -0.35147814 3.87468338 1.36245117
H  0.61791794 4.34457328 1.19225826
H  -0.91867703 4.46535352 2.08614102
H  -0.17914446 2.89019141 1.80408393
C  -2.5478466 3.18641583 0.31971114
H  -2.49085805 2.15877489 0.68825794
H  -3.05426948 3.78886509 1.07871188
H  -3.14012891 3.17630612 -0.59781381
P  0.31467341 -3.89230078 -0.35285156
C  -0.83057981 -4.85768648 0.71108827
H  -0.4744043 -5.88760646 0.81793906
H  -0.89300864 -4.39024954 1.69800194
H  -1.827743 -4.86209066 0.26184025
C  1.96117119 -4.10777666 0.43353982
H  2.1932528 -5.17176653 0.54839513
H  2.72509635 -3.63337955 -0.18916019
H  1.9621993 -3.62671828 1.41587196
C  0.42372341 -4.86369015 -1.90808861
H  -0.55011841 -4.86507127 -2.40589505
H  1.15728194 -4.40101881 -2.57454156
H  0.72540916 -5.89415329 -1.6935201
Au -0.28596775 -1.649739 -0.65507597
C  3.24558252 0.81786645 1.15611818
H  3.75315482 0.11727071 1.81357203
C  3.25352457 2.90018269 -0.09221932
H  3.75787868 3.80840232 -0.41219185
Br -2.49652401 0.55467679 -1.9425763
C  -1.13226777 3.67705117 0.07479615
O  -1.24766488 5.12346705 -0.54845011
C  -1.90550142 6.31129822 0.16111781
H  -2.2704379 5.89352539 1.09820793
H  -1.58018123 5.05756164 -1.46644942
C  -3.05340561 6.7817349 -0.7096376
H  -3.8050252 5.99865955 -0.84511626
H  -3.53450685 7.63277529 -0.21817179
H  -2.69511612 7.12144071 -1.68810707
C  -0.80058897 7.32090474 0.38577597
H  -1.2107425 8.17264415 0.93787442
H  0.01438516 6.88831395 0.97154293
H  -0.40506718 7.68096104 -0.56877287
