program: Gaussian 09
title: opt freq
version: EM64L-G09RevD.01
method: RB3LYP
basis: GenECP
operation: Freq
keyword: #P
keyword: Geom=AllCheck
keyword: Guess=TCheck
keyword: SCRF=Check
keyword: GenChk
keyword: RB3LYP/GenECP
keyword: Freq
converged: YES YES NO YES
title: Mulliken charges:
elementType: C C C C H H C C C H H C H C C H H H C H H H P C H H H C H H H C H H H Au C H C H Br
charge: 0.116008 0.088747 -0.195603 -0.134889 0.188096 0.155820 -0.097063 -0.100174 -0.380863 0.210008 0.199017 -0.203358 0.220966 0.294391 -0.538849 0.246227 0.244821 0.225880 -0.534862 0.232249 0.222490 0.258486 0.643774 -0.654185 0.200975 0.214399 0.214502 -0.654462 0.200772 0.214968 0.215025 -0.655471 0.214524 0.214494 0.200991 -0.180900 -0.142540 0.155369 -0.194005 0.152481 -0.078256
chargesum: 1.00000
title: Mulliken charges with hydrogens summed into heavy atoms:
elementType: C C C C C C C C C C C P C C C Au C C Br
charge: 0.116008 0.088747 -0.007507 0.020931 -0.097063 -0.100174 0.028161 0.017608 0.294391 0.178080 0.178362 0.643774 -0.024308 -0.023698 -0.025463 -0.180900 0.012830 -0.041525 -0.078256
polarizability: 3.87662420e+02 -6.98481724e+00 4.82259871e+02 -1.25654191e-01 -4.61617814e+00 2.09891270e+02
1716.lowfreq: -10.3079 -5.2191 -0.0006 0.0006 0.0010 7.0969 21.7946 28.1215 36.1322
frequency: 20.3809 27.5161 34.6391 45.3830 58.4119 76.1324 94.8253 101.8675 124.3534 143.9986 157.0380 163.6514 176.8994 188.9185 189.6628 196.3567 198.1299 203.9295 205.0498 228.9973 232.6387 243.2394 246.3688 274.5256 312.3157 336.6988 360.8484 422.3442 440.0963 464.7660 468.3688 541.9494 567.4750 582.0481 615.3838 632.0404 666.0369 728.1240 739.0030 740.3235 751.6137 782.0733 794.6827 820.3519 823.0868 853.2352 865.8583 878.8664 881.5870 884.6887 911.9351 958.1254 974.3416 985.4541 986.1513 992.3373 994.0202 998.9203 1008.2027 1044.8035 1073.5310 1096.1398 1142.5513 1189.2925 1202.4834 1223.6852 1240.4038 1253.7076 1284.6936 1320.8960 1332.3919 1338.6316 1349.6301 1350.9469 1367.3425 1367.5550 1378.1586 1385.8275 1429.1763 1456.6380 1469.9125 1474.6093 1477.2207 1478.1816 1483.8057 1486.4237 1487.1412 1493.7680 1496.5121 1509.1250 1514.0095 1519.8057 1552.9119 1618.6778 1647.9330 2999.5247 3018.0731 3057.6166 3060.9898 3061.2457 3061.6273 3073.9608 3087.1567 3099.1281 3132.0570 3146.9500 3147.5641 3147.8002 3154.6060 3155.4420 3156.5900 3176.3952 3188.1439 3192.6502 3194.3811 3204.7289 3218.6335
redmass: 3.8580 4.5173 3.4351 7.1106 3.5772 3.5297 8.1792 5.2766 4.8617 1.5045 3.3435 3.3924 3.5845 1.2886 1.6742 1.3206 1.0931 2.0169 1.2044 3.1076 3.5851 2.7415 2.4793 5.9700 3.8239 3.8789 3.9681 2.9818 3.1895 2.7539 3.1695 2.7117 5.0389 5.2061 6.0810 4.7079 4.0791 3.9445 4.1337 4.1477 2.8725 1.5933 4.0194 1.1605 2.2894 3.6393 2.3026 1.2436 1.2527 1.4218 2.4410 1.5103 2.4296 1.3927 1.3887 1.4733 1.4682 1.2982 2.5406 2.0652 2.3116 2.1357 2.0715 1.2445 1.1039 2.6760 2.3007 1.9676 1.5880 1.3255 2.1254 2.1206 1.2109 1.2107 1.2360 1.4666 1.3946 1.1990 1.7435 1.0714 1.0835 1.0531 1.0483 1.0485 1.0483 1.0507 1.6980 1.0440 1.4022 1.5054 1.6308 1.2994 6.6441 5.7004 5.5922 1.0565 1.0526 1.0823 1.0329 1.0330 1.0327 1.0613 1.0833 1.0738 1.1050 1.1047 1.1043 1.1048 1.1040 1.1042 1.1038 1.1052 1.0871 1.0892 1.1002 1.0923 1.0974
irintensity: 3.3276 7.6714 2.2660 0.1759 2.6239 3.2897 0.1295 0.6309 1.2810 8.4377 0.8391 0.5094 4.3766 0.1372 0.1556 5.8362 0.4004 6.6582 1.8085 5.9589 7.8229 0.3955 0.3148 1.9620 8.5689 9.3957 4.8561 6.0532 2.8108 1.3214 1.0795 15.9358 14.9798 3.6195 15.9922 10.7993 9.9236 1.9075 13.8099 12.8374 44.4627 50.1121 67.5755 0.0050 101.2223 44.3381 57.7581 7.1191 12.9023 8.5793 37.2721 5.5947 46.5759 43.9692 49.1188 250.9163 43.8470 1.0890 86.2984 59.3689 2.9917 54.8829 2.1223 50.4558 5.4666 10.2167 44.9648 35.1036 95.9130 108.9618 144.2208 98.2765 9.6373 10.1060 4.4817 21.1031 13.5368 109.9558 135.7649 10.5011 20.9923 0.1446 0.4313 0.2904 19.3432 18.6063 6.3525 11.4411 4.6729 31.3062 1.3176 11.5468 6.3562 12.1520 0.2464 70.9953 26.5544 4.8897 11.6532 5.7681 4.3985 15.4861 6.9141 8.8840 14.6542 0.6393 17.5372 3.2499 3.4261 4.8635 1.7015 8.8156 11.3005 0.5586 4.6807 31.0948 48.7759
temp: 298.150 k
press: 1.00000 atm
elementType: 6 6 6 6 1 1 6 6 6 1 1 6 1 6 6 1 1 1 6 1 1 1 15 6 1 1 1 6 1 1 1 6 1 1 1 79 6 1 6 1 35
symmnumber: 1
zpe: 883263.1 jmol-1
zpe.correction: 0.336417 hartree
zpe.thermalcorrener: 0.359747 hartree
zpe.thermalcorrenthalpy: 0.360691 hartree
zpe.thermalcorrgfe: 0.280931 hartree
zpe.sumelectzpe: -1112.806553 hartree
zpe.sumelectthermal: -1112.783224 hartree
zpe.sumelectthermalent: -1112.782279 hartree
zpe.sumelectthermalfe: -1112.862039 hartree
dipole: 0.2095 7.7984 0.2291
dipole: 7.8046
quadrupole: -93.1552 -53.6607 -140.5604
quadrupole: 42.0813 -4.8551 -3.6359
quadrupole: 2.6369 42.1314 -44.7683 42.0813 -4.8551 -3.6359
hfenergy: -1113.1429703 hartree
pointgroup: C01 [X(C16H22Au1Br1P1)]
dipole: 0.1159791 3.047058 0.1199528 debye
polarizability: 387.6624204|-6.9848172|482.2598708|-0.1256542|-4.6161781|209.8912697 unknown
InChI: InChI=1/C13H13Br.C3H9P.Au/c1-9(2)12-7-10-5-3-4-6-11(10)8-13(12)14;1-4(2)3;/h3-6,12H,7H2,1-2H3;1-3H3;/rC16H22AuBrP/c1-11(2)14-10-12-8-6-7-9-13(12)15(16(14)18)17-19(3,4)5/h6-9,14H,10H2,1-5H3
charge 1 multiplicity 1
41 atoms
C  2.79405591 0.59825043 0.07414255
C  1.68981508 -0.26941874 -0.10099271
C  1.95063863 -1.63737848 -0.30324038
C  4.33590638 -1.25228916 -0.18492709
H  1.11378188 -2.31579236 -0.44390553
H  5.35448175 -1.62793946 -0.21367217
C  0.30587326 0.26128632 -0.13377416
C  0.17197322 1.58805504 -0.341215
C  2.52942953 2.04660635 0.3643457
H  2.19809582 2.17645556 1.40051736
H  3.42277388 2.65621645 0.205563
C  1.34174754 2.52746122 -0.58678578
H  1.68649652 2.43164247 -1.62410785
C  1.16481938 3.93457402 -0.23713052
C  0.62908395 4.34667758 1.07153644
H  -0.12957022 5.12814619 0.93482888
H  1.45273555 4.8395181 1.61557741
H  0.22422501 3.52877558 1.66593191
C  1.60471781 4.97218493 -1.18138402
H  2.4609958 4.64917191 -1.78330113
H  1.77925878 5.94223811 -0.71200247
H  0.76869184 5.08776848 -1.89599885
P  -3.17527256 -2.45904491 0.26779611
C  -4.11181999 -2.27827758 1.83816878
H  -4.95617611 -2.97503525 1.86000093
H  -4.48430629 -1.25352352 1.92473098
H  -3.44904349 -2.48329697 2.68374764
C  -4.44083934 -2.23728599 -1.04555153
H  -5.27512308 -2.93037904 -0.89509372
H  -3.98615307 -2.42241196 -2.02295437
H  -4.81266182 -1.20895257 -1.02189638
C  -2.74742274 -4.2442657 0.19449084
H  -2.06086094 -4.48737296 1.01048831
H  -2.2526113 -4.46098355 -0.75663791
H  -3.64970622 -4.85815077 0.28372451
Au -1.33666108 -1.01838986 0.05543105
C  3.25544309 -2.12494943 -0.34485543
H  3.4299963 -3.18464596 -0.5073319
C  4.10077669 0.10892876 0.01486279
H  4.9357215 0.79264253 0.14459408
Br -1.57343983 2.42062618 -0.57419839
