program: Gaussian 09
title: opt freq
version: EM64L-G09RevD.01
method: RB3LYP
basis: GenECP
operation: Freq
keyword: #P
keyword: Geom=AllCheck
keyword: Guess=TCheck
keyword: SCRF=Check
keyword: GenChk
keyword: RB3LYP/GenECP
keyword: Freq
converged: YES YES NO NO
title: Mulliken charges:
elementType: C C C C H H C C C H H C H C C H H H C H H H P C H H H C H H H C H H H Au C H C H Br
charge: 0.094542 0.112023 -0.180405 -0.134877 0.195683 0.157253 0.014998 -0.273678 -0.338721 0.200486 0.186256 -0.221808 0.206408 0.273789 -0.531353 0.235383 0.214260 0.222515 -0.526401 0.243779 0.221075 0.211560 0.653090 -0.656354 0.204592 0.217288 0.218290 -0.657832 0.205192 0.217626 0.216269 -0.653762 0.217834 0.217851 0.204560 -0.091069 -0.153029 0.157308 -0.187397 0.156410 -0.069634
chargesum: 1.00000
title: Mulliken charges with hydrogens summed into heavy atoms:
elementType: C C C C C C C C C C C P C C C Au C C Br
charge: 0.094542 0.112023 0.015278 0.022376 0.014998 -0.273678 0.048021 -0.015400 0.273789 0.140806 0.150013 0.653090 -0.016185 -0.018744 -0.013518 -0.091069 0.004280 -0.030987 -0.069634
polarizability: 3.96292864e+02 2.36815723e+01 3.88979344e+02 -3.21534314e+01 2.81266693e+01 2.45263492e+02
1716.lowfreq: -10.9090 -6.1216 -0.0016 -0.0015 -0.0009 8.9407 21.9725 30.5325 34.1638
frequency: 20.1288 28.5749 33.6920 48.2646 65.5064 71.6928 87.5602 103.4821 114.0829 122.6782 152.0001 166.5076 169.3804 180.1183 185.9253 191.7952 201.1187 212.6935 218.3417 221.7396 245.9770 251.3143 253.9937 283.1458 337.0046 347.9129 363.7646 420.7201 440.6614 452.1608 474.1431 506.1531 566.6817 591.5475 599.3650 666.9184 699.5061 718.7487 726.7516 741.5991 743.4112 763.2737 768.9579 783.7258 821.1072 843.2924 872.9911 883.3845 885.6116 891.5487 925.4557 952.2574 970.2148 988.2513 990.4917 999.4516 1000.0053 1001.8549 1012.6493 1056.0181 1059.1416 1083.6267 1114.4448 1174.2749 1195.2180 1198.3330 1230.2085 1242.9786 1250.2775 1288.6211 1334.9206 1351.0694 1352.2273 1353.1767 1373.0554 1374.5763 1393.3615 1403.1435 1419.7993 1463.6932 1473.5978 1476.5896 1477.5064 1478.1843 1484.5905 1486.5004 1496.7314 1498.3859 1503.0607 1503.9351 1513.0267 1520.2905 1544.3106 1633.0876 1654.3813 3007.0746 3035.9362 3062.6365 3063.9094 3065.6268 3067.6251 3089.4184 3109.4952 3118.4867 3149.5704 3149.6306 3150.8205 3152.4838 3156.4287 3156.8361 3159.5367 3178.6869 3183.4725 3194.9442 3201.7618 3210.9228 3220.6809
redmass: 3.9920 3.2476 4.7458 6.2317 2.3717 5.1020 4.4118 1.6542 4.4628 3.8903 3.0843 3.0220 3.3909 2.6746 1.2094 4.0506 1.0664 3.2352 1.5883 1.1490 2.2346 2.5863 3.0489 2.7680 4.9877 3.8904 4.0257 3.6027 2.9576 2.6701 2.9589 3.0190 5.6567 4.7460 6.8627 4.1074 6.3249 6.0103 2.6691 4.1299 4.1388 3.0136 3.3866 1.8511 1.1611 4.0059 1.6165 1.2441 1.2443 1.3578 3.1321 1.6452 1.6532 1.3857 1.3842 1.3935 1.3506 1.4103 2.5789 1.9660 2.0216 1.7623 2.5955 1.2938 1.3777 1.2656 1.5179 2.0961 1.9693 1.7030 1.8370 2.3152 1.2096 1.2098 1.2014 2.6025 1.1940 1.3879 1.4375 1.1064 1.0533 1.0481 1.0475 1.1377 1.0489 1.0483 1.0435 1.6140 1.6364 1.6263 1.3438 1.3126 5.1477 6.0067 6.1923 1.0579 1.0451 1.0327 1.0324 1.0324 1.0622 1.0926 1.1038 1.0729 1.1045 1.0884 1.1049 1.1048 1.1043 1.1041 1.1038 1.1057 1.1002 1.0863 1.0893 1.0933 1.0974
irintensity: 5.0294 0.9957 3.4243 1.5981 3.4269 0.6130 6.6671 6.0833 0.2754 2.4265 1.7496 1.5923 19.6903 0.1142 0.2100 0.8211 0.0297 6.0182 1.0218 5.5040 6.2824 0.7615 45.2455 9.1619 20.7717 15.5874 5.1158 6.9874 14.7406 13.3693 39.0253 18.1580 25.6159 8.5479 47.2730 11.7317 5.4718 40.6235 54.7224 11.2524 18.5062 12.6855 17.4962 76.5741 0.0167 22.1172 47.4878 7.4233 9.5796 0.4153 4.3441 2.2357 19.8845 43.2799 47.6922 175.1154 97.2600 6.2765 4.8993 14.5471 17.8431 79.8763 9.3807 3.7002 14.9319 0.8359 3.1475 22.8371 43.3093 40.5114 6.6306 59.3110 10.1310 11.4224 0.4415 8.6272 39.2343 69.2948 20.9843 4.0053 0.0309 0.5061 0.0289 2.3662 20.3259 19.2630 12.6393 30.2055 21.5972 19.4681 17.4874 2.2568 108.6170 0.7775 2.9736 19.2160 11.0506 9.9555 3.5969 4.0498 28.1590 1.8833 12.0265 19.6247 10.1167 1.9602 5.7383 1.3449 3.5619 2.3358 1.6905 3.4387 6.2272 2.7268 7.3132 34.3311 30.0459
temp: 298.150 k
press: 1.00000 atm
elementType: 6 6 6 6 1 1 6 6 6 1 1 6 1 6 6 1 1 1 6 1 1 1 15 6 1 1 1 6 1 1 1 6 1 1 1 79 6 1 6 1 35
symmnumber: 1
zpe: 883583.5 jmol-1
zpe.correction: 0.336539 hartree
zpe.thermalcorrener: 0.359885 hartree
zpe.thermalcorrenthalpy: 0.360830 hartree
zpe.thermalcorrgfe: 0.281031 hartree
zpe.sumelectzpe: -1112.815491 hartree
zpe.sumelectthermal: -1112.792145 hartree
zpe.sumelectthermalent: -1112.791200 hartree
zpe.sumelectthermalfe: -1112.870999 hartree
dipole: 2.5011 0.4841 2.2039
dipole: 3.3685
quadrupole: -101.4763 -78.8759 -133.5581
quadrupole: 40.1466 1.0492 8.7243
quadrupole: 3.1604 25.7609 -28.9213 40.1466 1.0492 8.7243
hfenergy: -1113.15203 hartree
pointgroup: C01 [X(C16H22Au1Br1P1)]
dipole: 0.5931161 0.459978 0.8933705 debye
polarizability: 396.2928639|23.6815723|388.9793441|-32.1534314|28.1266693|245.2634924 unknown
InChI: InChI=1/C13H13Br.C3H9P.Au/c1-9(2)12-7-10-5-3-4-6-11(10)13(12)8-14;1-4(2)3;/h3-6,12H,7H2,1-2H3;1-3H3;/rC16H22AuBrP/c1-11(2)14-10-12-8-6-7-9-13(12)15(14)16(18)17-19(3,4)5/h6-9,14H,10H2,1-5H3
charge 1 multiplicity 1
41 atoms
C  2.75201693 0.94307849 -1.19312182
C  1.75367721 0.36121587 -0.39317152
C  1.84524262 -0.98636587 -0.02501303
C  3.88043628 -1.17514283 -1.33864093
H  1.10686533 -1.43221348 0.63369111
H  4.70570448 -1.77986571 -1.70307023
C  0.71827559 1.36598752 -0.05644025
C  -0.58831659 1.09996747 0.21807211
C  2.50521154 2.42245516 -1.38769618
H  2.16179382 2.64081019 -2.40544939
H  3.39889663 3.02915959 -1.21110855
C  1.3711873 2.76691069 -0.39138475
H  0.63235737 3.47113775 -0.77337592
C  1.73791275 3.04739796 0.9973237
C  2.97669952 2.51234291 1.61186283
H  3.76744385 3.24428125 1.37165283
H  2.90270767 2.4599436 2.70077062
H  3.30100303 1.55749722 1.19601664
C  0.92097251 3.95028273 1.84355861
H  0.31176434 3.35806866 2.54243366
H  1.59509249 4.54911576 2.46878333
H  0.25626818 4.59409763 1.26846384
P  -2.56305988 -2.8416714 0.05635213
C  -4.01801077 -3.04704825 1.15661403
H  -4.43393817 -4.05465243 1.05320788
H  -3.71634755 -2.88255968 2.19493113
H  -4.78113359 -2.30994098 0.89119507
C  -1.4310416 -4.21627453 0.50424488
H  -1.94378036 -5.17937687 0.41462741
H  -0.56458558 -4.20122486 -0.16303038
H  -1.08429301 -4.08270618 1.53283984
C  -3.17692944 -3.27104575 -1.61953524
H  -3.91720454 -2.53106981 -1.93611481
H  -2.34259029 -3.25796167 -2.32657307
H  -3.63438833 -4.26566299 -1.61330125
Au -1.53159409 -0.74467177 0.16681224
C  2.90875223 -1.7502964 -0.51060493
H  2.98880869 -2.79632167 -0.22943426
C  3.81075153 0.18097833 -1.67681818
H  4.57931293 0.63551984 -2.29570085
Br -1.80789402 2.58633354 0.53235765
