program: Gaussian 09
title: opt freq
version: EM64L-G09RevD.01
method: RB3LYP
basis: GenECP
operation: Freq
keyword: #P
keyword: Geom=AllCheck
keyword: Guess=TCheck
keyword: SCRF=Check
keyword: GenChk
keyword: RB3LYP/GenECP
keyword: Freq
converged: YES YES YES YES
title: Mulliken charges:
elementType: C C C C H H C C C H H C H C C H H H C H H H P C H H H C H H H C H H H Au C H C H Br
charge: 0.089542 0.120449 -0.191506 -0.134371 0.192239 0.154051 0.072960 -0.321934 -0.358467 0.188144 0.187563 -0.157301 0.207447 -0.006601 -0.465234 0.196024 0.197513 0.207952 -0.465076 0.204618 0.199510 0.209152 0.650448 -0.654865 0.205389 0.217740 0.217159 -0.657340 0.206062 0.217664 0.218035 -0.654994 0.217173 0.217833 0.205411 -0.064154 -0.154801 0.153556 -0.194100 0.152483 0.174629
chargesum: 1.00000
title: Mulliken charges with hydrogens summed into heavy atoms:
elementType: C C C C C C C C C C C P C C C Au C C Br
charge: 0.089542 0.120449 0.000733 0.019680 0.072960 -0.321934 0.017240 0.050146 -0.006601 0.136255 0.148204 0.650448 -0.014577 -0.015579 -0.014578 -0.064154 -0.001245 -0.041617 0.174629
polarizability: 3.80376087e+02 1.82629215e+01 4.02394718e+02 1.61579183e+01 1.29078930e+01 2.04864723e+02
1716.lowfreq: -0.0007 -0.0006 0.0010 4.0439 6.8709 11.5837 22.2627 29.3840 34.2137
frequency: 21.6041 29.3553 33.5543 53.4343 70.5340 78.8959 96.7441 118.6846 156.2156 164.1376 174.4442 179.8083 192.7879 196.6804 214.7869 217.8266 225.6504 229.8131 247.5803 249.3382 254.2315 270.6734 275.7525 307.1366 313.4114 335.2016 351.8282 386.2210 424.8242 460.7872 492.2174 520.6718 534.7076 548.5220 602.4851 668.4979 678.3225 678.9409 742.0470 742.2636 743.5663 766.8850 780.4871 816.7860 823.6028 844.5374 880.6526 885.6127 887.2765 888.5380 937.2664 955.3799 962.6103 972.5541 991.5973 991.7667 997.5482 1004.6705 1008.1580 1034.4736 1057.8020 1082.5639 1115.2358 1121.6923 1137.7117 1197.6952 1208.5331 1221.9472 1257.0870 1267.6030 1289.6869 1319.2625 1337.8590 1353.7577 1354.6333 1374.3986 1376.1557 1430.8750 1444.2246 1474.6275 1477.9629 1478.7151 1485.4162 1487.5478 1488.7875 1499.7574 1500.3915 1504.4711 1507.3052 1512.5845 1519.4073 1530.9185 1631.5714 1644.5091 1665.2956 2245.5945 3049.4857 3062.6877 3064.3657 3064.5583 3065.2708 3076.5560 3119.4545 3129.6402 3138.7858 3149.6313 3150.7500 3151.5274 3157.5969 3158.2033 3160.2241 3168.8448 3172.9341 3191.3309 3197.3180 3206.6586 3217.7146
redmass: 3.4362 4.3078 4.0864 5.3198 4.1956 5.8124 4.8448 9.9377 3.3759 3.4743 4.0791 4.1617 2.5682 1.2848 3.1829 1.0585 1.1784 3.2414 1.9331 2.5811 2.2086 3.0019 1.7868 1.5816 2.9302 2.4482 3.8206 2.9632 3.5333 3.6271 3.2931 6.3169 2.8362 3.7564 5.7814 4.2342 6.3926 4.2667 2.7731 3.7931 3.6283 2.6952 1.8923 5.2424 1.1596 3.1698 2.5910 1.2450 1.3719 1.2486 1.7899 1.4413 1.8656 2.5864 1.3829 1.3855 1.2960 1.4709 2.1620 1.4383 2.1931 2.0112 2.2771 3.4523 2.3886 1.1441 1.8477 1.4331 1.7764 3.4001 2.8419 2.6355 1.7041 1.2083 1.2081 3.5343 1.2004 1.2302 1.1927 1.0530 1.0481 1.0479 1.0477 1.0505 1.0478 1.0474 1.1820 1.0585 2.4670 1.1847 1.7165 1.0625 6.0159 7.8547 8.0657 2.3224 1.0455 1.0328 1.0326 1.0327 1.0432 1.0600 1.1022 1.0887 1.0937 1.1043 1.1046 1.1050 1.1043 1.1046 1.1037 1.1062 1.1058 1.0863 1.0892 1.0935 1.0973
irintensity: 0.8490 4.4875 1.7449 0.5969 1.3399 2.1648 0.9667 11.2444 2.0862 2.9318 19.9838 30.0155 7.4964 1.0541 5.7628 0.0665 0.3564 6.6202 1.1030 0.6375 1.8071 3.8623 10.2992 2.4803 1.3064 4.9442 16.7807 65.9375 2.2723 5.2673 6.6107 66.1024 24.1878 19.6433 3.6573 14.4120 18.6133 6.4361 29.6063 3.8201 12.3220 9.9812 37.7753 11.8829 0.0039 2.8007 7.6013 6.6285 1.8391 8.7957 6.7237 0.8134 2.0532 36.4459 50.4853 60.8331 1.2709 245.0311 4.3320 1.1352 7.3753 45.0730 86.6474 2.6572 33.0839 4.9480 1.4839 10.1687 3.8261 8.0883 26.8932 15.8264 8.3123 9.5442 9.4588 11.0347 0.2051 25.7430 18.4689 0.1408 0.4148 0.2081 18.9168 3.7974 19.1341 12.6788 0.7182 3.7245 6.1389 23.1496 8.9836 9.6705 1.0455 9.1208 9.2050 5.2901 0.5803 9.9243 3.3083 3.1286 0.1921 36.9510 15.6542 8.2391 4.4261 9.9972 1.5297 4.6514 3.0484 4.0163 0.7681 8.9741 7.0022 4.1467 3.0775 35.4972 40.7152
temp: 298.150 k
press: 1.00000 atm
elementType: 6 6 6 6 1 1 6 6 6 1 1 6 1 6 6 1 1 1 6 1 1 1 15 6 1 1 1 6 1 1 1 6 1 1 1 79 6 1 6 1 35
symmnumber: 1
zpe: 880282.3 jmol-1
zpe.correction: 0.335282 hartree
zpe.thermalcorrener: 0.358073 hartree
zpe.thermalcorrenthalpy: 0.359018 hartree
zpe.thermalcorrgfe: 0.281253 hartree
zpe.sumelectzpe: -1112.821825 hartree
zpe.sumelectthermal: -1112.799034 hartree
zpe.sumelectthermalent: -1112.798090 hartree
zpe.sumelectthermalfe: -1112.875854 hartree
dipole: -1.4940 0.9167 1.0296
dipole: 2.0328
quadrupole: -121.8515 -51.1767 -142.1563
quadrupole: -6.5694 0.5842 1.3029
quadrupole: -16.7900 53.8848 -37.0948 -6.5694 0.5842 1.3029
hfenergy: -1113.1571073 hartree
pointgroup: C01 [X(C16H22Au1Br1P1)]
dipole: -1.7065492 -0.2997165 0.3286669 debye
polarizability: 380.376087|18.2629215|402.394718|16.1579183|12.907893|204.8647234 unknown
InChI: InChI=1/C13H13Br.C3H9P.Au/c1-13(2)12-7-9-5-3-4-6-10(9)11(12)8-14-13;1-4(2)3;/h3-6,12H,7H2,1-2H3;1-3H3;/rC16H22AuBrP/c1-16(2)13-10-11-8-6-7-9-12(11)14(13)15(18-16)17-19(3,4)5/h6-9,13H,10H2,1-5H3
charge 1 multiplicity 1
41 atoms
C  2.49975097 3.04706055 0.04419545
C  2.03598559 1.73249168 -0.14899897
C  2.92728399 0.65301595 -0.14830263
C  4.74790923 2.21526113 0.23562654
H  2.56768873 -0.35992846 -0.30471783
H  5.80949031 2.39488201 0.37951617
C  0.5797125 1.75788439 -0.32477428
C  -0.28450387 0.73262783 -0.33777185
C  1.36131552 4.04805394 0.04859767
H  1.55352308 4.91980163 -0.58330726
H  1.1896352 4.4199072 1.06484058
C  0.15564632 3.21502144 -0.48427188
H  0.05018282 3.40882692 -1.55966412
C  -1.19736873 3.47928674 0.17207832
C  -2.00425485 4.61127319 -0.41486793
H  -2.04893578 4.56467745 -1.50529278
H  -3.01548512 4.64909928 -0.00272562
H  -1.49364739 5.54319469 -0.13378846
C  -1.2532471 3.37397536 1.68028636
H  -0.79438813 4.28013634 2.0946657
H  -2.28492455 3.33568211 2.03580352
H  -0.70134696 2.50712418 2.0507613
P  -0.09712088 -3.62550881 0.07512462
C  -1.09667766 -4.29689893 1.46065193
H  -0.9720236 -5.3827084 1.52532753
H  -0.77374439 -3.83701895 2.39876368
H  -2.15195853 -4.06076825 1.29725689
C  1.6146101 -4.19704814 0.41043807
H  1.63708717 -5.28606786 0.51949429
H  2.26543665 -3.90038999 -0.41686553
H  1.97952821 -3.73080361 1.3300389
C  -0.63465771 -4.58428107 -1.39507894
H  -1.6812698 -4.35637409 -1.61557015
H  -0.02343051 -4.3039679 -2.25748432
H  -0.52799888 -5.65751886 -1.20612056
Au -0.24987991 -1.30287329 -0.17003764
C  4.28517126 0.90497137 0.04552735
H  4.99147689 0.07973043 0.04256538
C  3.85684501 3.2931263 0.23714047
H  4.21886218 4.30692811 0.38485124
Br -2.14539341 1.60720038 -0.49833022
