program: Gaussian 09
title: opt freq
version: EM64L-G09RevD.01
method: RB3LYP
basis: GenECP
operation: Freq
keyword: #P
keyword: Geom=AllCheck
keyword: Guess=TCheck
keyword: SCRF=Check
keyword: GenChk
keyword: RB3LYP/GenECP
keyword: Freq
converged: YES YES NO YES
title: Mulliken charges:
elementType: C C C C H H C C C H H C H C C H H H C H H H P C H H H C H H H C H H H Au C H C H Br
charge: 0.199808 -0.040777 -0.123186 -0.101348 0.186750 0.172143 0.389058 -0.447228 -0.415484 0.192610 0.176692 -0.166617 0.133879 0.190069 -0.538391 0.181410 0.169172 0.177971 -0.516652 0.159412 0.163111 0.159995 0.673459 -0.657603 0.214533 0.225279 0.223003 -0.659688 0.214305 0.225905 0.227617 -0.658732 0.224791 0.226774 0.214750 -0.037866 -0.145560 0.170939 -0.212430 0.165698 0.062432
chargesum: 1.00000
title: Mulliken charges with hydrogens summed into heavy atoms:
elementType: C C C C C C C C C C C P C C C Au C C Br
charge: 0.199808 -0.040777 0.063564 0.070794 0.389058 -0.447228 -0.046183 -0.032738 0.190069 -0.009839 -0.034134 0.673459 0.005212 0.008138 0.007584 -0.037866 0.025379 -0.046733 0.062432
polarizability: 3.94470361e+02 -6.90318281e+01 3.04134944e+02 1.62001111e+01 -1.56553831e+01 2.78362128e+02
1716.lowfreq: -2.1228 -0.0011 0.0008 0.0009 8.1601 15.9833 25.6552 36.1490 41.2068
frequency: 24.8821 35.8355 41.0194 43.4617 52.6815 56.6718 70.9248 85.7278 86.3504 112.0259 118.8108 156.2603 166.0200 177.8467 185.8238 191.2605 200.4928 214.5811 218.6371 224.0320 224.6783 254.7490 261.3529 266.8260 292.3855 303.0564 344.5528 357.9784 374.8706 421.1987 432.8263 459.6304 477.6492 525.1200 548.3071 563.4219 603.7190 623.1705 668.6428 742.3382 745.6376 746.9622 780.0687 781.6078 798.2082 829.4887 851.1251 875.8514 887.7082 891.3411 905.5583 954.8040 974.7648 981.9507 995.8070 998.6849 1000.4490 1014.2008 1028.2142 1051.1741 1072.1574 1118.0790 1127.8147 1139.2112 1201.2304 1208.1602 1217.6283 1246.7625 1256.0246 1311.0160 1335.8931 1355.2809 1357.9143 1366.9820 1378.4551 1404.6577 1438.6479 1447.3566 1470.0630 1474.5286 1476.2516 1483.4045 1484.9320 1486.8869 1496.7752 1497.5295 1505.2683 1513.0238 1515.7001 1518.6806 1523.9477 1609.4172 1645.3021 1746.2933 2098.4759 3026.7434 3032.1291 3039.9376 3065.3384 3067.7621 3071.0905 3073.9349 3076.2581 3084.1330 3122.7721 3141.5146 3149.2023 3153.4997 3155.0846 3157.9952 3163.0371 3163.9451 3168.3967 3199.8057 3210.8164 3217.7181 3230.4380
redmass: 4.4395 7.1323 8.0235 5.0609 4.1740 3.5748 4.4131 7.2578 4.4824 3.7505 3.3421 3.0725 2.7899 1.2796 1.4979 1.8802 3.6484 1.1321 1.8825 1.1900 1.6508 2.5655 2.6060 2.9145 4.7461 3.5542 4.2305 3.5583 3.5608 2.9401 3.9958 2.4432 3.6119 5.1899 3.4644 3.9728 6.1906 6.1145 4.2030 3.5956 4.1306 4.1004 3.2980 1.4107 2.2457 1.1606 2.4412 2.1045 1.2417 1.2512 1.6293 1.9341 1.3722 1.3985 1.3809 1.3717 1.4516 1.3223 1.2429 2.4405 2.3855 1.6544 2.2329 1.8502 1.3602 1.1988 2.1131 3.1744 1.9545 1.4779 2.4709 1.2060 1.2058 2.0763 1.1928 1.3419 1.3125 1.2267 1.0528 1.0473 1.0476 1.0473 1.0476 2.1267 1.0455 1.0423 1.1518 1.0989 1.2104 1.5357 1.1200 5.0029 5.3886 6.3162 11.9960 1.0389 1.0421 1.0635 1.0326 1.0327 1.0324 1.0996 1.0995 1.0970 1.1006 1.0944 1.0885 1.1045 1.1045 1.1043 1.1048 1.1046 1.1036 1.0881 1.0893 1.0934 1.0978
irintensity: 0.7351 0.9231 4.6471 2.9149 0.1581 1.2701 0.1628 0.7610 0.6952 6.6377 8.7109 4.0825 1.4077 0.4216 1.3121 0.8848 1.4836 0.6973 10.1930 0.5011 2.1987 0.9293 7.6376 2.1964 2.8022 9.6532 8.7356 13.9817 39.6443 54.4334 39.8070 5.7409 66.2188 2.5346 90.7150 70.9179 33.5827 34.1051 12.8537 15.7015 11.4861 11.2079 13.2885 42.3535 2.4558 0.0865 10.3238 13.7529 7.6038 5.8673 5.8654 10.1767 1.3767 0.3716 53.2872 48.4549 285.7446 0.3454 3.5443 1.2225 1.3082 1.4631 0.2317 20.5714 4.2484 6.4301 2.9791 75.8053 46.7018 12.0637 12.4181 11.7798 9.8280 8.2565 0.5088 2.8059 8.0706 3.7985 0.2574 0.5493 0.6516 22.1118 21.8641 16.3357 1.5180 12.4040 16.9623 5.0859 8.8150 34.6075 11.4541 11.9006 119.0671 8.1038 354.5639 32.1708 60.0151 28.3969 5.1201 1.3450 1.2404 2.6496 70.5896 14.3841 28.6272 47.4965 41.5585 5.9550 0.7706 0.8262 1.0928 1.1953 0.3250 5.3656 4.3631 17.7228 26.1405
temp: 298.150 k
press: 1.00000 atm
elementType: 6 6 6 6 1 1 6 6 6 1 1 6 1 6 6 1 1 1 6 1 1 1 15 6 1 1 1 6 1 1 1 6 1 1 1 79 6 1 6 1 35
symmnumber: 1
zpe: 882872.3 jmol-1
zpe.correction: 0.336268 hartree
zpe.thermalcorrener: 0.360548 hartree
zpe.thermalcorrenthalpy: 0.361492 hartree
zpe.thermalcorrgfe: 0.279592 hartree
zpe.sumelectzpe: -1112.798369 hartree
zpe.sumelectthermal: -1112.774090 hartree
zpe.sumelectthermalent: -1112.773145 hartree
zpe.sumelectthermalfe: -1112.855045 hartree
dipole: -4.9142 -4.1003 0.0527
dipole: 6.4003
quadrupole: -94.1038 -123.0213 -129.2303
quadrupole: 4.1384 -8.0500 -4.2101
quadrupole: 21.3480 -7.5695 -13.7785 4.1384 -8.0500 -4.2101
hfenergy: -1113.1346376 hartree
pointgroup: C01 [X(C16H22Au1Br1P1)]
dipole: -2.0300352 -1.8274467 0.6678414 debye
polarizability: 394.4703614|-69.0318281|304.134944|16.2001111|-15.6553831|278.3621276 unknown
InChI: InChI=1/C13H13Br.C3H9P.Au/c1-11(2)7-8-12-5-3-4-6-13(12)9-10-14;1-4(2)3;/h3-7H,8H2,1-2H3;1-3H3;/rC16H22AuBrP/c1-13(2)10-11-14-8-6-7-9-15(14)12-16(18)17-19(3,4)5/h6-10H,11H2,1-5H3
charge 1 multiplicity 1
41 atoms
C  2.53287289 -0.04975936 -0.09050376
C  2.0194665 -0.29042472 -1.39571193
C  2.65973468 -1.19356441 -2.27448194
C  4.33526777 -1.6111616 -0.59894202
H  2.23671057 -1.36056312 -3.25989103
H  5.2401949 -2.11930348 -0.27903639
C  0.86133247 0.38096835 -1.85704097
C  -0.16298678 0.94483585 -2.28874485
C  1.84863422 0.89881511 0.87543841
H  0.83035438 0.54032749 1.0668865
H  2.38018102 0.84433127 1.8347915
C  1.83245675 2.32853001 0.38160529
H  2.7994155 2.69027279 0.03111705
C  0.78654434 3.16753838 0.32820553
C  -0.61401259 2.83841665 0.78308152
H  -1.31287086 2.88676948 -0.06380009
H  -0.95972827 3.57835091 1.51723108
H  -0.70902467 1.84922711 1.23680847
C  0.94587405 4.56452894 -0.22392904
H  0.66470224 5.3184412 0.52405003
H  0.28081145 4.71437995 -1.08562204
H  1.97220073 4.76640923 -0.54625137
P  -2.77990744 -1.41715482 0.50074839
C  -3.23238345 -0.39306565 1.95156019
H  -3.92387691 -0.9436168 2.59755455
H  -3.70784271 0.53046564 1.61022858
H  -2.32991365 -0.13888377 2.51422145
C  -4.36433494 -1.87497769 -0.29538127
H  -5.01983966 -2.35868296 0.4359712
H  -4.1710504 -2.56114778 -1.1243067
H  -4.85088525 -0.97595722 -0.68336266
C  -2.09371766 -2.97397785 1.18212749
H  -1.1780166 -2.75548373 1.73844204
H  -1.856836 -3.65633728 0.36148509
H  -2.82398331 -3.44291803 1.84931298
Au -1.30735882 -0.32396593 -0.91822896
C  3.81873575 -1.84720027 -1.8771862
H  4.31507022 -2.53512202 -2.55384763
C  3.6968523 -0.72679924 0.2760335
H  4.11334815 -0.55962251 1.26517349
Br -0.9345175 2.3077816 -3.25081838
