program: Gaussian 09
title: opt freq
version: EM64L-G09RevD.01
method: RB3LYP
basis: GenECP
operation: Freq
keyword: #P
keyword: Geom=AllCheck
keyword: Guess=TCheck
keyword: SCRF=Check
keyword: GenChk
keyword: RB3LYP/GenECP
keyword: Freq
converged: YES YES YES YES
title: Mulliken charges:
elementType: C C C C H H C C H H C H C C H H H C H C H C H Br C H H H
charge: 0.104584 0.114912 -0.182842 -0.132619 0.165666 0.164219 0.186360 -0.392755 0.237928 0.217565 -0.282935 0.237966 0.297757 -0.529703 0.238867 0.227798 0.260067 -0.139094 0.164329 -0.177936 0.164388 -0.311301 0.225974 -0.071448 -0.525608 0.266960 0.238104 0.232797
chargesum: 1.00000
title: Mulliken charges with hydrogens summed into heavy atoms:
elementType: C C C C C C C C C C C C Br C
charge: 0.104584 0.114912 -0.017175 0.031599 0.186360 0.062738 -0.044969 0.297757 0.197029 0.025235 -0.013548 -0.085327 -0.071448 0.212254
polarizability: 1.87401044e+02 5.48144159e+00 2.98583585e+02 -2.57162239e+01 1.73305476e+01 1.13095926e+02
1716.lowfreq: -0.0005 -0.0004 0.0005 4.9104 7.6763 25.2517 52.5264 72.6527 91.9293
frequency: 50.8838 72.5523 91.6566 104.9992 119.3665 133.2716 146.1181 203.9249 208.6408 229.6183 258.2864 345.0056 420.7349 429.6334 447.8013 476.6804 513.3234 553.2753 589.3125 626.1129 645.3577 712.9306 745.9486 770.3326 780.4740 802.0380 808.4606 821.4207 844.4260 859.7057 885.4850 928.2753 961.6479 1003.5514 1005.8622 1030.0745 1050.8812 1059.1474 1103.8100 1129.5241 1165.9812 1200.9701 1207.4288 1240.2203 1254.8508 1267.6851 1273.1920 1316.5736 1338.5410 1355.5567 1372.1282 1379.1571 1383.6098 1417.3414 1447.5922 1465.3511 1498.0465 1506.7873 1511.6248 1522.8172 1525.8923 1634.0052 1648.4129 1683.9909 2988.5924 3012.2519 3056.4984 3089.5420 3116.7749 3118.0030 3135.2078 3183.8280 3193.1596 3201.0992 3207.7025 3216.3644 3225.7842 3254.5604
redmass: 3.5362 4.5695 4.1218 2.5814 1.2890 1.4188 1.9472 3.7197 5.7643 3.4271 2.7378 3.3531 2.9967 3.2801 2.8246 2.7853 2.8479 4.0285 6.1195 4.8183 5.4674 2.6690 4.5648 1.4245 2.2457 1.4599 1.9964 2.4996 4.3325 4.5031 1.3924 1.7977 1.3919 1.2975 2.1225 1.4356 2.4919 2.0627 1.8587 2.2585 1.1692 1.1347 1.8695 1.8162 1.5618 1.4310 1.2843 2.5417 1.6291 1.4941 1.5319 2.5159 1.1849 1.4792 1.1413 1.3151 1.1834 2.3146 1.4312 2.0416 1.1359 6.1237 5.9370 9.4215 1.0592 1.0544 1.0674 1.0800 1.0923 1.0707 1.0875 1.1086 1.1019 1.0867 1.0894 1.0939 1.0976 1.0930
irintensity: 5.8689 3.7903 5.0354 0.1848 4.2993 0.4257 11.5553 1.3805 3.4141 15.2185 4.3103 2.5798 5.9709 0.9165 1.6771 6.0521 8.0956 8.8478 4.6534 21.6402 2.7984 1.6156 29.7353 52.8095 55.4867 25.0058 32.7466 5.7648 59.9857 29.2782 1.3753 21.8861 9.5533 0.0820 31.2229 13.0542 14.5656 0.7730 47.4586 1.2432 67.4928 1.6417 4.6803 64.5102 19.0950 56.1809 31.3839 6.2133 2.0351 38.0079 77.3131 26.8850 44.1468 81.4469 7.6064 10.2341 4.9249 16.5521 30.2047 3.3654 18.7609 2.0627 3.5208 8.9922 77.8274 30.1595 26.3490 14.2704 0.4884 2.4359 0.5095 0.5328 3.5945 1.4837 2.1635 23.3660 30.1954 14.1619
temp: 298.150 k
press: 1.00000 atm
elementType: 6 6 6 6 1 1 6 6 1 1 6 1 6 6 1 1 1 6 1 6 1 6 1 35 6 1 1 1
symmnumber: 1
zpe: 607629.2 jmol-1
zpe.correction: 0.231434 hartree
zpe.thermalcorrener: 0.245072 hartree
zpe.thermalcorrenthalpy: 0.246016 hartree
zpe.thermalcorrgfe: 0.190112 hartree
zpe.sumelectzpe: -516.551041 hartree
zpe.sumelectthermal: -516.537403 hartree
zpe.sumelectthermalent: -516.536459 hartree
zpe.sumelectthermalfe: -516.592363 hartree
dipole: 7.5216 -0.1226 1.2582
dipole: 7.6271
quadrupole: -62.1275 -68.2536 -83.2197
quadrupole: 10.2717 -1.7396 1.8452
quadrupole: 9.0728 2.9466 -12.0194 10.2717 -1.7396 1.8452
hfenergy: -516.7824752 hartree
pointgroup: C01 [X(C13H14Br1)]
dipole: 2.4334819 1.4399727 0.344208 debye
polarizability: 187.4010438|5.4814416|298.5835846|-25.7162239|17.3305476|113.0959258 unknown
InChI: InChI=1/C13H14Br/c1-9(2)12-7-10-5-3-4-6-11(10)13(12)8-14/h3-6,8,12H,7H2,1-2H3
charge 1 multiplicity 1
28 atoms
C  0.54158809 -2.09837665 -0.52961846
C  -0.64586454 -1.52850738 -0.0439787
C  -1.69820066 -2.3453718 0.38743489
C  -0.34507279 -4.29469176 -0.14362165
H  -2.61952803 -1.9141271 0.76691625
H  -0.23673188 -5.3745903 -0.17474645
C  -0.54306762 -0.0652758 -0.04790028
C  1.53448097 -1.06333297 -0.98661164
H  1.68501051 -1.03223642 -2.06922712
H  2.52603579 -1.21765448 -0.54043332
C  0.83121131 0.32814802 -0.57246588
H  0.78016067 0.98884529 -1.44028558
C  1.807323 0.8088829 0.40411093
C  1.69467091 0.40328074 1.81226598
H  1.32836303 -0.62643329 1.905532
H  2.60806465 0.56043299 2.38541387
H  0.88979263 1.02875427 2.23726206
C  -1.53893245 -3.72884846 0.32912047
H  -2.345109 -4.37581569 0.66134079
C  0.70751781 -3.48177193 -0.57043912
H  1.63248256 -3.91808765 -0.93555274
C  -1.47412759 0.8084623 0.35267477
H  -2.45387302 0.52200324 0.71372654
Br -1.18449186 2.6959386 0.3688806
C  2.89666312 1.69167917 -0.03209678
H  2.56032172 2.70476545 0.26180581
H  3.82945001 1.50955313 0.50782072
H  3.04092426 1.70288431 -1.11435925
