program: Gaussian 09
title: opt freq
version: EM64L-G09RevD.01
method: RB3LYP
basis: GenECP
operation: Freq
keyword: #P
keyword: Geom=AllCheck
keyword: Guess=TCheck
keyword: SCRF=Check
keyword: GenChk
keyword: RB3LYP/GenECP
keyword: Freq
converged: YES YES NO YES
title: Mulliken charges:
elementType: C C C C H H C C C H H H C C H H H C H H H P C H H H C H H H C H H H Au C H C H Br C C H H H H O
charge: 0.090262 0.120858 -0.197137 -0.141403 0.198053 0.152480 0.071129 -0.359989 -0.410366 0.192252 0.200690 0.185687 -0.101740 -0.500440 0.154164 0.187373 0.174220 -0.481116 0.164988 0.173890 0.190511 0.657370 -0.656287 0.202719 0.216871 0.216296 -0.655852 0.203549 0.214884 0.216900 -0.654138 0.215748 0.215393 0.203166 -0.118035 -0.152294 0.152354 -0.187864 0.150699 -0.121416 0.216876 -0.257788 0.253055 0.233611 0.221725 0.499297 -0.551209
chargesum: 1.00000
title: Mulliken charges with hydrogens summed into heavy atoms:
elementType: C C C C C C C C C C P C C C Au C C Br C C O
charge: 0.090262 0.120858 0.000916 0.011077 0.071129 -0.359989 -0.017423 0.083948 0.015318 0.048274 0.657370 -0.020401 -0.020518 -0.019832 -0.118035 0.000060 -0.037164 -0.121416 0.216876 0.450602 -0.051912
polarizability: 4.05719526e+02 1.43080387e+01 3.89248576e+02 -4.75472445e+00 5.29492755e-01 2.35701854e+02
1716.lowfreq: -19.6615 -5.4632 0.0003 0.0011 0.0011 6.6408 18.8440 30.9050 36.6098
frequency: 17.1212 30.6360 35.3702 47.2860 49.9018 71.0879 80.4530 97.8741 106.5600 118.3240 129.4304 134.4091 154.1006 157.1360 170.2546 187.0675 195.4220 199.6561 209.2931 210.5255 215.9707 223.0178 226.1768 246.1676 249.5020 250.9264 288.2437 320.1094 333.9499 351.1713 352.0544 364.8204 414.3780 432.9492 448.4698 481.0876 504.6372 571.4814 579.5936 588.3859 629.6702 667.0339 676.8228 701.8744 718.0327 738.7165 739.9847 741.3570 764.4205 794.1049 820.7573 840.2964 870.6811 882.5417 884.5696 886.7480 922.9628 930.1452 955.7488 959.2925 984.5969 986.5360 989.5496 995.2686 998.9231 1002.9912 1034.9449 1062.7137 1073.1314 1125.4315 1141.3941 1183.7497 1195.1766 1197.3111 1198.7898 1210.1328 1218.1406 1247.4221 1256.8742 1307.7736 1342.2057 1350.8166 1354.4251 1362.1695 1372.6416 1377.3671 1391.1272 1404.9325 1441.5884 1459.4968 1475.6339 1476.8582 1477.9037 1478.3409 1485.7954 1488.2090 1492.1106 1496.4421 1504.8415 1507.5880 1512.0888 1517.1240 1519.2598 1528.3891 1531.1534 1546.8001 1589.5429 1635.4590 1659.9456 3040.5016 3061.9243 3063.3393 3063.4891 3064.5726 3064.7369 3105.8958 3119.6634 3121.1145 3123.1317 3133.4704 3143.0022 3144.2307 3148.6174 3149.6521 3151.1633 3156.3024 3157.0800 3158.4200 3189.3664 3195.6246 3204.4347 3216.8565 3225.0547 3258.0441 3643.1080
redmass: 4.5588 4.5236 3.6171 3.1510 5.5941 2.2099 4.4850 5.0989 1.6625 5.2760 3.7673 2.8720 3.3478 3.6059 3.4810 3.5946 1.0736 3.3113 1.1559 1.1305 2.5684 1.3129 2.4772 1.3907 2.5595 2.3072 3.1166 2.8982 2.6386 3.9559 3.8079 4.4923 4.9104 2.8171 2.6582 3.4092 3.3423 3.7314 4.7459 4.6117 4.1044 4.0372 2.4900 3.4986 3.1549 4.0123 3.9983 4.1481 1.8223 2.8192 1.1592 3.8360 3.5738 1.2540 1.4171 1.2467 2.8239 4.2800 1.4123 1.2060 1.4195 1.3907 1.3819 1.3109 2.0047 1.6115 2.3599 2.2385 2.2908 2.4293 1.8274 1.3355 1.8206 1.2491 1.5333 1.4818 2.0863 1.5076 2.6287 1.8793 2.3220 1.2112 1.2081 1.3704 1.1976 2.3723 1.3491 1.3310 1.2263 1.1980 1.0529 1.0485 1.0482 1.1102 1.0479 1.0480 1.0730 1.0432 2.3731 1.0681 1.1646 1.2026 1.5663 1.0609 1.0839 1.0448 9.1165 6.2627 6.3426 1.0462 1.0329 1.0327 1.0569 1.0326 1.0494 1.0904 1.0889 1.0290 1.0925 1.1019 1.1006 1.0994 1.1042 1.1047 1.1047 1.1043 1.1043 1.1034 1.0862 1.0892 1.0931 1.0972 1.1120 1.1094 1.0675
irintensity: 6.1910 3.2758 2.7319 0.0545 0.9345 0.8413 1.3602 0.7124 3.9258 1.6731 1.1145 4.6439 3.2037 4.7095 0.7640 0.2596 0.1520 3.8484 0.2187 0.1809 21.8759 0.2241 5.5670 4.0597 0.9111 0.8843 2.4211 3.6095 5.2471 5.2136 8.3778 3.9980 30.0666 3.2684 8.9547 11.5035 0.7659 116.2428 37.4753 10.0788 0.1296 9.2231 30.5170 102.1030 37.5157 16.5292 7.6278 9.8615 17.6889 71.3701 0.0274 5.7174 40.2049 7.1967 3.0445 8.4126 27.2185 39.9454 3.9000 1.7702 3.8159 50.3176 41.0862 4.0170 138.3456 157.3485 42.2566 4.3410 29.3212 1.8115 21.5457 9.5133 36.5747 7.9568 8.5685 4.0113 4.0654 6.7192 7.4230 4.2406 8.8902 10.5658 10.2175 3.0153 0.0177 10.7654 49.0017 52.2426 23.7547 3.7349 0.0195 0.5791 0.1464 4.3226 19.5019 20.1663 2.9071 9.4018 18.5114 0.1856 19.5318 1.8001 18.3438 9.0245 23.7652 21.3893 74.3127 0.0905 0.3873 44.2096 11.5313 3.3383 34.4236 3.9057 13.3777 30.5623 12.5981 8.2290 13.5200 1.6255 39.6989 35.3834 13.7476 0.5030 5.3783 4.2838 4.2347 0.2554 4.3592 6.3376 28.5364 43.4767 1.4152 2.4236 249.6829
temp: 298.150 k
press: 1.00000 atm
elementType: 6 6 6 6 1 1 6 6 6 1 1 1 6 6 1 1 1 6 1 1 1 15 6 1 1 1 6 1 1 1 6 1 1 1 79 6 1 6 1 35 6 6 1 1 1 1 8
symmnumber: 1
zpe: 1036352.8 jmol-1
zpe.correction: 0.394726 hartree
zpe.thermalcorrener: 0.421063 hartree
zpe.thermalcorrenthalpy: 0.422007 hartree
zpe.thermalcorrgfe: 0.336206 hartree
zpe.sumelectzpe: -1228.498884 hartree
zpe.sumelectthermal: -1228.472546 hartree
zpe.sumelectthermalent: -1228.471602 hartree
zpe.sumelectthermalfe: -1228.557404 hartree
dipole: 2.4101 4.9153 -4.2092
dipole: 6.9056
quadrupole: -146.0889 -45.9893 -143.7815
quadrupole: 6.7132 1.9501 -11.1947
quadrupole: -34.1357 65.9639 -31.8283 6.7132 1.9501 -11.1947
hfenergy: -1228.8936095 hartree
pointgroup: C01 [X(C17H26Au1Br1O1P1)]
dipole: -0.2866109 1.1707662 -1.6646611 debye
polarizability: 405.7195263|14.3080387|389.2485758|-4.7547244|0.5294928|235.7018541 unknown
InChI: InChI=1/C14H17BrO.C3H9P.Au/c1-10(2)14(16-3)8-11-6-4-5-7-12(11)13(14)9-15;1-4(2)3;/h4-7,10,16H,8H2,1-3H3;1-3H3;/rC17H26AuBrOP/c1-12(2)17(20-3)11-13-9-7-8-10-14(13)15(17)16(19)18-21(4,5)6/h7-10,12,20H,11H2,1-6H3
charge 1 multiplicity 1
47 atoms
C  2.79222657 2.37119267 -0.21049657
C  2.01683126 1.21477934 -0.03178115
C  2.66108994 -0.02615772 0.07430359
C  4.81221666 1.07010399 -0.21527906
H  2.08830497 -0.93260125 0.2407166
H  5.89417024 1.00498529 -0.28367739
C  0.57338289 1.56252838 0.04291147
C  -0.43960556 0.66196837 0.05705556
C  1.93378706 3.60467351 -0.265795
H  1.94694322 4.05940289 -1.26299269
H  2.27415467 4.38047035 0.4247169
H  -1.04944996 3.2393104 1.53460499
C  -0.05670388 3.67656275 1.4095983
C  -0.20732462 5.20856833 1.39346542
H  -0.92649208 5.56547876 0.644268
H  -0.59817417 5.5363437 2.36140269
H  0.74574164 5.72332078 1.23325112
C  0.80902713 3.22457823 2.60056813
H  1.82266589 3.63682807 2.55259154
H  0.34915247 3.57985035 3.52766701
H  0.88148548 2.13447324 2.65223736
P  -0.41182681 -3.74482394 -0.18045862
C  -2.03723237 -4.54002598 0.13240548
H  -1.94670996 -5.62901795 0.06191959
H  -2.39156013 -4.26769528 1.13049532
H  -2.76282183 -4.18697034 -0.60592619
C  0.72941434 -4.52576156 1.02813023
H  0.70802015 -5.61539403 0.92453217
H  1.74662633 -4.16321253 0.8542008
H  0.42816004 -4.25014582 2.04281878
C  0.11567753 -4.40751308 -1.80982938
H  -0.5707986 -4.05509302 -2.58481726
H  1.12196479 -4.04809082 -2.04296861
H  0.11412813 -5.50231678 -1.79223903
Au -0.42395821 -1.40782142 -0.05969558
C  4.05062067 -0.09041164 -0.02318479
H  4.54710075 -1.05307583 0.06142265
C  4.18015558 2.31207014 -0.30408805
H  4.76070741 3.22075139 -0.43848355
Br -2.31802628 1.31710439 0.13834496
C  0.52395016 3.09255507 0.10486546
C  -0.385637 3.05974401 -2.3900628
H  -0.49843318 1.98297326 -2.31154299
H  -1.2225679 3.51095268 -2.91930985
H  0.57301613 3.33858458 -2.82665191
H  -0.52342548 4.5521458 -0.99987559
O  -0.47812187 3.57445746 -1.00681752
