program: Gaussian 09
title: optfreq
version: EM64L-G09RevD.01
method: RB3LYP
basis: Gen
operation: Freq
keyword: #P
keyword: Geom=AllCheck
keyword: Guess=TCheck
keyword: SCRF=Check
keyword: GenChk
keyword: RB3LYP/ChkBas
keyword: Freq
title: opt freq
converged: YES YES NO YES
title: Mulliken charges:
elementType: C H H O H C H H O H H H H
charge: -0.237984 0.206162 0.537999 -0.661822 0.489626 -0.237466 0.205758 0.490053 -0.661110 0.214768 0.219020 0.215498 0.219498
chargesum: 1.00000
title: Mulliken charges with hydrogens summed into heavy atoms:
elementType: C O C O
charge: 0.403174 -0.172196 0.402080 0.366943
polarizability: 3.38939931e+01 1.65041178e+00 4.01231038e+01 6.58721514e-02 -3.07898465e-02 3.12808720e+01
1716.lowfreq: -65.0772 -24.1684 -0.0013 0.0010 0.0011 17.7580 98.7190 127.7990 171.1595
frequency: 64.5050 126.2303 170.0352 180.2295 192.1975 522.9453 539.4740 642.1695 658.4128 991.7349 1000.2535 1073.4941 1108.4815 1186.5652 1197.4873 1368.9996 1386.5213 1476.6449 1502.8890 1515.1230 1515.9993 1518.3493 1528.6240 1535.4546 1748.4541 3095.8746 3097.9663 3193.0081 3195.7573 3215.1901 3216.6267 3706.6117 3712.5923
redmass: 2.1910 2.5738 1.0700 1.9236 1.5321 1.0862 5.2254 1.1602 1.2538 2.7746 6.1435 1.1288 1.0902 1.2408 1.2592 1.2943 1.2859 1.0927 1.1070 1.0530 1.0559 1.0516 1.0440 1.1067 1.0514 1.0303 1.0291 1.1085 1.1097 1.1113 1.1109 1.0662 1.0664
irintensity: 7.1473 5.5992 0.6813 17.9476 12.8567 7.6503 53.0913 292.1646 4071.8710 127.7569 61.3043 257.7837 13.7558 6.0313 74.5001 418.5982 57.0148 71.2557 5.6698 61.3515 12.8666 24.0945 27.6002 327.2973 217.1204 7.4769 17.1892 11.4194 7.5547 5.6372 4.2300 210.3928 127.9192
temp: 298.150 k
press: 1.00000 atm
elementType: 6 1 1 8 1 6 1 1 8 1 1 1 1
symmnumber: 1
zpe: 306153.7 jmol-1
zpe.correction: 0.116608 hartree
zpe.thermalcorrener: 0.123590 hartree
zpe.thermalcorrenthalpy: 0.124534 hartree
zpe.thermalcorrgfe: 0.086205 hartree
zpe.sumelectzpe: -231.752469 hartree
zpe.sumelectthermal: -231.745487 hartree
zpe.sumelectthermalent: -231.744542 hartree
zpe.sumelectthermalfe: -231.782872 hartree
dipole: -0.0199 -0.0037 0.6927
dipole: 0.6930
quadrupole: -18.3487 -10.4631 -22.9194
quadrupole: 4.2313 0.1160 0.0073
quadrupole: -1.1050 6.7806 -5.6756 4.2313 0.1160 0.0073
hfenergy: -231.869077 hartree
pointgroup: C01 [X(C2H9O2)]
dipole: -0.0120223 -0.0014128 0.2625395 debye
dipolederiv: 0.2874716 -0.1922163 0.1404316 -0.1066773 0.4406017 -0.2649448 0.0907172 -0.3516288 0.7132308 0.0210652 0.0593604 0.0684703 0.070219 0.032935 -0.0308247 0.0259665 0.0243865 -0.047411 0.3707004 0.490723 -0.0026258 0.3140556 2.189282 -0.0061074 0.0005994 0.0018376 0.2938283 -0.4763947 -0.044299 0.1726079 -0.04475 -1.4314218 -0.1677765 0.1235119 -0.2142396 -0.7792975 0.3860357 -0.003139 -0.0357131 0.0139348 0.3293976 -0.080281 -0.0321728 -0.0842958 0.3979243 0.311754 -0.2197989 -0.1670828 -0.1237177 0.4515532 0.2599036 -0.1163732 0.34271 0.6821154 0.0242408 0.0590747 -0.0664441 0.0677224 0.0354017 0.0312474 -0.023106 -0.023164 -0.0552989 0.3843276 -0.0070199 0.0367133 0.0105396 0.3346019 0.0826063 0.0305154 0.0846564 0.3994902 -0.4540014 -0.0696071 -0.1469842 -0.0608201 -1.4268727 0.1774504 -0.0980398 0.2209396 -0.8038894 -0.0303391 -0.0190517 0.0281351 -0.065158 0.0841054 -0.0201662 -0.0198128 -0.0479775 0.0629891 0.1012754 -0.0159292 0.023202 -0.0038772 -0.0645978 -0.0076735 0.0327584 0.0201952 0.0390643 -0.0312077 -0.0202131 -0.0326608 -0.0636412 0.0875468 0.0167123 0.0150323 0.0457277 0.0607057 0.1050721 -0.0178839 -0.0180492 -0.0078299 -0.0625329 0.0098542 -0.0295965 -0.0191474 0.0365488 unknown
polarizability: 33.8939931|1.6504118|40.1231038|0.0658722|-0.0307898|31.280872 unknown
InChI: InChI=1/C2H9O2/c1-3-5-4-2/h3-4H,1-2H3
charge 1 multiplicity 1
13 atoms
C  0.14278842 -1.90624656 0.61181293
H  -0.46573449 -1.56006892 1.44992581
H  0.02809855 -0.00771827 -0.59318807
O  0.26869728 1.17593399 -0.61439908
H  1.21643645 1.3334807 -0.78285229
C  -0.18292193 1.91528486 0.56518479
H  0.37549769 1.60038219 1.44925952
H  -1.15281353 -1.33757429 -0.84071856
O  -0.21666194 -1.18620517 -0.61130543
H  -1.24203553 1.6842759 0.67287116
H  -0.04561954 2.97846036 0.36996263
H  1.19714326 -1.69342226 0.78283744
H  -0.00439908 -2.97063485 0.4311941
