program: Gaussian 09
title: optfreq
version: EM64L-G09RevD.01
method: RB3LYP
basis: Gen
operation: Freq
keyword: #P
keyword: Geom=AllCheck
keyword: Guess=TCheck
keyword: SCRF=Check
keyword: GenChk
keyword: RB3LYP/ChkBas
keyword: Freq
title: opt freq
converged: YES YES NO YES
title: Mulliken charges:
elementType: C H H O H C H H O H H H H
charge: -0.236624 0.206111 0.536795 -0.661732 0.488604 -0.236370 0.205712 0.489023 -0.661396 0.216926 0.217624 0.217311 0.218016
chargesum: 1.00000
title: Mulliken charges with hydrogens summed into heavy atoms:
elementType: C O C O
charge: 0.404814 -0.173128 0.403892 0.364422
polarizability: 3.32534153e+01 -2.25756717e-03 4.13035664e+01 3.77375702e-03 -1.36621801e+00 3.15131424e+01
1716.lowfreq: -27.3692 -0.0002 0.0010 0.0011 3.1935 69.9989 77.9069 110.7929 132.3281
frequency: 77.7091 110.2617 132.1329 167.3755 169.2951 473.0570 564.0968 600.0031 684.1321 977.9274 1018.6842 1044.9742 1100.8941 1185.1076 1189.4775 1324.1534 1402.5945 1493.7517 1499.0090 1510.1591 1511.9315 1519.1716 1519.9697 1539.0074 1705.1991 3099.4733 3099.9766 3196.5648 3197.4021 3217.4875 3217.9037 3701.1694 3703.3798
redmass: 2.3663 2.0615 1.1221 2.8313 1.3309 1.1022 4.6980 1.2155 1.2318 5.5434 3.0800 1.1002 1.0841 1.2335 1.2707 1.3536 1.2293 1.1256 1.0771 1.0501 1.0576 1.0427 1.0800 1.0807 1.0557 1.0292 1.0291 1.1100 1.1101 1.1107 1.1108 1.0664 1.0670
irintensity: 0.9025 9.2518 0.0295 0.8679 2.8216 17.7998 14.7503 421.2503 3969.5971 10.2908 334.8968 7.4798 115.3248 108.2207 3.1937 5.6274 597.4781 2.4312 114.5910 15.0180 16.7972 25.6192 148.4679 289.8521 100.8281 10.9817 13.8502 9.4574 9.2554 5.2330 4.6276 93.0503 239.9707
temp: 298.150 k
press: 1.00000 atm
elementType: 6 1 1 8 1 6 1 1 8 1 1 1 1
symmnumber: 1
zpe: 304769.2 jmol-1
zpe.correction: 0.116080 hartree
zpe.thermalcorrener: 0.123228 hartree
zpe.thermalcorrenthalpy: 0.124172 hartree
zpe.thermalcorrgfe: 0.085475 hartree
zpe.sumelectzpe: -231.753162 hartree
zpe.sumelectthermal: -231.746015 hartree
zpe.sumelectthermalent: -231.745071 hartree
zpe.sumelectthermalfe: -231.783768 hartree
dipole: 2.8954 -0.0139 0.0022
dipole: 2.8954
quadrupole: -18.6182 -6.4457 -23.0068
quadrupole: -0.0032 0.0100 -0.7790
quadrupole: -2.5946 9.5779 -6.9833 -0.0032 0.0100 -0.7790
hfenergy: -231.8692427 hartree
pointgroup: C01 [X(C2H9O2)]
dipole: 1.0867889 -0.0073864 0.0037403 debye
dipolederiv: 0.3725197 0.2970669 0.1199492 0.1888189 0.6566735 0.273512 0.0999719 0.3695558 0.4707453 -0.0096941 -0.0069717 0.0841947 -0.0423081 0.0293088 -0.0374613 0.0435562 -0.0786913 -0.0187864 0.2805373 0.0010233 -0.0006321 0.0001038 2.0469402 -0.4157068 -0.0003854 -0.8813208 0.4865401 -0.4861722 0.2704131 0.1085115 0.1623256 -1.4838925 -0.0179953 0.0991637 0.164194 -0.7253577 0.3817634 0.0081209 -0.0027147 0.0161509 0.2763717 -0.0369875 -0.0168951 -0.0320518 0.4467798 0.3743096 -0.2988313 -0.1199859 -0.1899318 0.6569022 0.2717771 -0.1003098 0.3681114 0.4698183 -0.0094326 0.0070663 -0.0843776 0.0422541 0.0288347 -0.037592 -0.0438517 -0.0789602 -0.0200633 0.3828501 -0.0082047 0.0029713 -0.0165826 0.2768902 -0.0374132 0.0172712 -0.0322368 0.4473947 -0.4839403 -0.2699138 -0.1081485 -0.1608817 -1.4854437 -0.0181816 -0.0988616 0.1642154 -0.7257172 -0.0003116 -0.022888 0.0507933 -0.0786983 0.0361871 0.0066813 0.0323593 -0.0352203 0.0828626 0.098079 0.0375279 0.0093377 0.0432282 -0.0381232 0.0215403 0.0008544 0.0540756 0.0012999 0.000982 0.0229918 -0.0508432 0.0785165 0.0364736 0.0068085 -0.0323009 -0.0353446 0.0827805 0.0985098 -0.0374007 -0.0090557 -0.0429956 -0.0371226 0.0210187 -0.0005723 0.0536737 0.0017034 unknown
polarizability: 33.2534153|-0.0022576|41.3035664|0.0037738|-1.366218|31.5131424 unknown
InChI: InChI=1/C2H9O2/c1-3-5-4-2/h3-4H,1-2H3
charge 1 multiplicity 1
13 atoms
C  -0.2857376 -2.12067794 -0.26033741
H  0.390594 -2.35305666 -1.08524004
H  0.3469772 -0.00049535 0.00055301
O  0.27822622 1.05789615 -0.57520829
H  1.14254816 1.32501383 -0.93981717
C  -0.28829599 2.12281868 0.25524265
H  0.38399127 2.35652515 1.08312904
H  1.13985965 -1.32251332 0.94180725
O  0.27669786 -1.05600502 0.57382969
H  -1.2374108 1.73676337 0.6238553
H  -0.45201875 2.99350559 -0.3792353
H  -1.2333603 -1.73460312 -0.63269393
H  -0.4515929 -2.9917398 0.37298413
