program: Gaussian 09
title: opt freq
version: EM64L-G09RevD.01
method: RB3LYP
basis: Gen
operation: Freq
keyword: #P
keyword: Geom=AllCheck
keyword: Guess=TCheck
keyword: SCRF=Check
keyword: GenChk
keyword: RB3LYP/ChkBas
keyword: Freq
converged: YES YES YES YES
title: Mulliken charges:
elementType: C H H O C H O H H H H H O C H H H H O C H H H H
charge: -0.201207 0.123463 0.439966 -0.692905 -0.207744 0.142959 -0.691712 0.157045 0.143607 0.129300 0.144329 0.453485 -0.694391 -0.234846 0.139623 0.175659 0.143421 0.454610 -0.647516 -0.214660 0.436711 0.159301 0.177360 0.164140
chargesum: 0.00000
title: Mulliken charges with hydrogens summed into heavy atoms:
elementType: C O C O O C O C
charge: 0.195885 -0.239420 0.235868 -0.251746 -0.239781 0.223858 -0.210805 0.286142
polarizability: 7.81784852e+01 1.12034926e+00 8.14669248e+01 1.66636873e-01 9.08992067e-01 6.84439576e+01
1716.lowfreq: -10.2355 -0.0011 -0.0010 -0.0001 7.2501 12.3415 25.8069 39.3659 53.3635
frequency: 22.6460 38.8456 52.0271 57.5492 69.4488 77.4187 86.7024 95.4181 105.9038 113.2073 122.4773 132.0658 137.6363 163.0468 216.1392 238.8805 270.9058 338.4437 444.2364 749.3388 835.5877 994.1679 1037.9134 1058.1047 1064.6483 1076.8210 1098.7413 1143.1080 1153.4257 1158.0321 1185.2626 1187.6604 1188.6725 1193.5571 1389.7927 1469.1896 1495.7761 1498.3268 1501.8066 1506.1210 1508.5657 1513.4018 1517.0015 1517.2147 1518.2333 1530.0525 1536.0310 1538.8842 1541.8700 1544.6091 2983.0971 3009.9397 3013.2486 3023.9444 3038.3795 3063.7575 3065.5944 3100.5217 3101.8542 3124.0755 3147.0097 3155.5257 3314.3601 3437.3668 3460.9749 3746.2030
redmass: 3.5690 4.1263 2.7592 2.7863 2.9360 2.5370 2.7392 1.6698 1.5534 1.9649 1.1848 1.7024 2.5300 2.3123 1.3054 4.0912 5.4915 5.1368 1.0960 1.0395 1.0530 1.1284 6.5594 6.0031 5.6038 6.7241 1.1157 1.1668 1.1675 1.1631 1.2661 1.2793 1.2767 1.2535 1.2736 1.2028 1.1622 1.1517 1.1361 1.1228 1.1488 1.1287 1.0494 1.0508 1.0575 1.0423 1.0483 1.0495 1.0467 1.0394 1.0366 1.0339 1.0350 1.1042 1.0333 1.1063 1.1060 1.0973 1.1074 1.1007 1.1008 1.1027 1.0699 1.0676 1.0664 1.0663
irintensity: 0.9966 2.7581 10.5981 4.8451 3.2717 3.2244 6.3279 1.7845 2.2671 0.7946 1.3423 2.9206 4.0839 10.9843 1.3568 32.4206 9.4276 21.0800 174.0277 211.2805 40.6258 149.1380 126.5949 170.4251 169.4661 80.0458 48.0125 6.5858 7.9383 60.9816 1.0807 2.1831 2.2314 4.3078 46.4344 54.9193 5.9040 19.1764 6.1206 38.7777 49.2344 12.9779 3.6253 3.8699 0.3496 10.1836 0.7028 16.0912 5.9073 10.5647 97.0115 164.8647 17.4653 127.8767 64.7614 83.1964 90.2190 93.6489 62.6438 87.0558 8.7957 29.3375 1418.2896 794.9992 791.1871 55.8736
temp: 298.150 k
press: 1.00000 atm
elementType: 6 1 1 8 6 1 8 1 1 1 1 1 8 6 1 1 1 1 8 6 1 1 1 1
symmnumber: 1
zpe: 561172.8 jmol-1
zpe.correction: 0.213739 hartree
zpe.thermalcorrener: 0.229828 hartree
zpe.thermalcorrenthalpy: 0.230772 hartree
zpe.thermalcorrgfe: 0.166981 hartree
zpe.sumelectzpe: -462.705896 hartree
zpe.sumelectthermal: -462.689808 hartree
zpe.sumelectthermalent: -462.688864 hartree
zpe.sumelectthermalfe: -462.752655 hartree
dipole: 2.3990 5.9043 -1.6432
dipole: 6.5815
quadrupole: -46.0251 -46.9781 -53.0032
quadrupole: 7.7707 -4.5370 1.0572
quadrupole: 2.6437 1.6907 -4.3344 7.7707 -4.5370 1.0572
hfenergy: -462.9196359 hartree
pointgroup: C01 [X(C4H16O4)]
dipole: 0.9438242 2.3229276 -0.6464836 debye
dipolederiv: 0.7407773 -0.122597 -0.2864225 -0.0470504 0.4967544 0.0840328 -0.2829385 0.1541066 0.6366031 -0.061809 -0.0772555 0.0716478 -0.1186104 -0.18623 0.1025759 0.0951834 0.066743 -0.0396061 0.7321626 -0.1848582 0.0614245 -0.2994999 0.5716503 -0.0126794 0.2792398 -0.1033814 0.2653918 -1.3569411 -0.0548816 0.1149487 -0.1664809 -0.8584676 0.0611842 -0.0105375 0.0487363 -0.6811922 0.9829183 0.0147418 -0.1632781 0.0994798 0.3529184 -0.0508817 -0.2908996 -0.018521 0.4947252 -0.0376246 -0.0177315 -0.0284565 0.0042441 0.0523246 -0.0277888 0.0498048 -0.0192189 -0.2348371 -1.101648 0.1652167 0.2883712 0.1946001 -0.8659059 -0.1050658 0.1248664 -0.0922888 -0.7120606 -0.0160476 -0.0666311 0.0035635 -0.1145207 -0.1461198 -0.0383514 0.0025678 -0.0525148 0.0506175 -0.1831909 0.1074842 -0.0293141 0.1498201 -0.0707504 0.0640765 -0.0179371 0.0764011 -0.0005841 -0.0386683 -0.0415236 -0.0523119 -0.0387136 -0.0708715 -0.1402704 0.0057526 -0.1713254 -0.186839 -0.1240204 0.1165308 -0.0535775 0.1167238 -0.0206318 0.0459388 -0.0835424 0.0625652 -0.0166184 0.5057218 0.2901754 0.1071497 0.4292492 0.8055786 0.0840903 0.2160303 0.1638014 0.3685335 -1.0442948 -0.0331909 -0.1826046 -0.0067102 -1.041239 0.0585499 -0.2404248 0.0699029 -0.6973016 0.8452843 -0.0992649 0.1760316 -0.1945699 0.2615847 -0.008195 0.185155 0.032279 0.448378 -0.1457803 0.0296647 0.0713141 0.0026657 0.0753153 0.0048858 0.1304026 -0.0035165 -0.1301572 0.0342496 -0.0022609 0.0134723 0.0297144 0.0469572 0.0869003 -0.0056557 0.083256 0.0566671 -0.0705689 -0.02531 -0.0847478 -0.0526928 -0.0595954 -0.1431331 -0.100913 -0.1371799 -0.1048084 0.2763395 0.095252 -0.057321 0.0436146 0.8435066 -0.1811917 -0.0760324 -0.3370148 0.4531234 -0.4570615 -0.1660623 -0.1510419 -0.1340377 -1.0653333 -0.0524702 -0.2136191 -0.0797621 -0.7704152 0.391139 0.1234566 0.1360625 0.1300707 0.6897617 0.1743639 0.1889334 0.3295033 0.5413004 0.2377382 -0.0329981 0.0717828 -0.0335678 0.3341501 -0.0470786 0.0607754 -0.0626262 0.3374874 -0.1116632 0.0369911 -0.1217266 0.0847035 -0.0212128 0.0143083 -0.0985629 -0.0196178 -0.0256307 -0.0449823 0.0203272 0.1063236 -0.0117442 0.0609464 -0.0261767 0.0722606 -0.0605064 -0.0299399 0.0479704 -0.0752751 -0.0112897 -0.0666873 -0.1850906 0.0523763 0.0100909 0.0701793 -0.0228369 unknown
polarizability: 78.1784852|1.1203493|81.4669248|0.1666369|0.9089921|68.4439576 unknown
InChI: InChI=1/4CH4O/c4*1-2/h4*2H,1H3
charge 0 multiplicity 1
24 atoms
C  1.50036349 -3.01451332 -0.28736246
H  1.90288358 -2.06389496 -0.67436696
H  -0.25243806 -2.35789466 0.23875633
O  -1.45604474 -1.35751441 -0.59058905
C  -2.69805065 -1.46140358 0.1014025
H  -2.57916103 -1.33410024 1.18707531
O  0.49302511 -2.82066217 0.69013578
H  -3.10256918 -2.4600067 -0.08807653
H  -3.42374543 -0.71836446 -0.25875766
H  1.14660875 -3.60722189 -1.14628139
H  2.32542913 -3.56092253 0.18260637
H  -1.07287304 -0.47119572 -0.36226159
O  -0.35098751 0.8974402 0.36646899
C  0.96804578 0.54522502 0.79020993
H  1.68613084 0.58145652 -0.0415251
H  0.92817858 -0.47977873 1.16706895
H  1.32234758 1.21384992 1.58711229
H  -0.27676929 1.71247214 -0.18342293
O  0.16236705 3.18164913 -1.04803633
C  0.73018136 4.11567381 -0.11876284
H  0.82759064 2.98143777 -1.72609622
H  1.62694018 3.71304731 0.36903908
H  -0.03242597 4.29967694 0.64091454
H  0.97914102 5.06301985 -0.61168394
