program: Gaussian 09
title: Opt freq
version: EM64L-G09RevD.01
method: RB3LYP
basis: GenECP
operation: Freq
keyword: #P
keyword: Geom=AllCheck
keyword: Guess=TCheck
keyword: SCRF=Check
keyword: GenChk
keyword: RB3LYP/GenECP
keyword: Freq
converged: YES YES NO YES
title: Mulliken charges:
elementType: P Au C H H H C H H H C H H H C C H C H H C C C C H C H C H H H N C H C O O C H C C C C H C H C H H H
charge: 0.633388 -0.281285 -0.652735 0.212097 0.198359 0.211894 -0.655295 0.213284 0.198358 0.212332 -0.654645 0.213204 0.198025 0.213015 -0.010836 -0.214859 0.216402 -0.426832 0.173810 0.104337 0.145413 -0.165723 -0.202027 -0.137320 0.177882 -0.136270 0.150622 -0.137595 0.150416 0.151153 0.149720 -0.402926 -0.108707 0.271302 0.591433 -0.331636 -0.392639 0.387084 0.290926 0.228981 -0.125948 -0.140841 -0.139186 0.180148 -0.146315 0.185294 -0.112679 0.172953 0.174375 0.170091
chargesum: 1.00000
title: Mulliken charges with hydrogens summed into heavy atoms:
elementType: P Au C C C C C C C C C C C C N C C O O C C C C C C C
charge: 0.633388 -0.281285 -0.030385 -0.031322 -0.030401 -0.010836 0.001543 -0.148685 0.145413 0.012159 -0.051404 0.013096 0.014883 0.012125 -0.402926 0.162595 0.591433 -0.331636 -0.392639 0.678010 0.228981 0.054200 0.044453 0.033767 0.028061 0.057412
polarizability: 4.10689857e+02 1.92900071e+00 3.45600892e+02 -1.46937571e+01 3.05724576e+00 3.21505795e+02
1716.lowfreq: -5.9989 -0.0015 -0.0011 0.0006 5.6371 8.7624 21.0468 25.3844 28.8857
frequency: 19.5846 25.1815 28.7820 38.3413 52.0874 55.6265 64.0574 68.9609 87.9980 96.1078 111.8119 122.4867 125.5338 153.3713 164.0115 172.6844 178.0882 183.2701 195.0566 214.0114 241.4371 241.8141 249.5257 264.1301 294.6434 314.9862 341.8427 349.4093 359.2331 364.7984 416.7997 421.6556 429.8258 439.7741 480.4902 515.1846 550.0779 554.8994 598.7291 623.5795 629.9677 632.2472 657.2181 668.1921 680.3162 700.0501 713.6917 720.9839 739.3302 742.0463 745.4648 772.5409 784.3424 810.3783 821.9015 827.2373 844.1424 861.2971 882.8327 887.1559 892.3979 903.4554 924.1449 934.5487 943.7341 977.7409 980.2010 984.8287 985.8926 994.2409 1002.1554 1005.2496 1008.3640 1013.7408 1017.3227 1019.6909 1047.3906 1060.3354 1062.3483 1083.8990 1119.2721 1125.0614 1156.0116 1198.5787 1204.5745 1211.7657 1219.9233 1221.0660 1245.7751 1262.4416 1275.1262 1305.0203 1314.8654 1352.1474 1352.2115 1353.5526 1361.6713 1371.1735 1375.1712 1378.0026 1378.5104 1407.0865 1473.1320 1479.4014 1480.7451 1481.0529 1487.0096 1491.0059 1498.7784 1504.5729 1506.7086 1540.6585 1543.4079 1639.7694 1643.0205 1650.8849 1658.2878 1671.1221 1675.6657 1966.1588 3026.8089 3057.8424 3059.7378 3060.5196 3096.5364 3143.4492 3145.1495 3145.6482 3146.1037 3152.8038 3154.2142 3156.0709 3170.2619 3192.2119 3202.3378 3207.4066 3209.0681 3214.2218 3217.6904 3224.2800 3224.7847 3231.7205 3239.0777 3293.5823
redmass: 5.3453 4.6906 5.3146 3.1456 5.0649 5.1353 6.3740 3.8726 4.5002 6.0517 6.3896 4.7839 4.3439 3.7087 4.2494 1.1498 3.5457 3.8814 5.0452 1.1019 1.9823 1.7022 2.4656 2.5156 5.6196 3.8874 5.7879 4.5885 3.4852 4.3344 2.9806 3.0408 5.6912 5.7136 4.2255 4.2900 3.3402 2.5616 3.6915 4.2523 6.2455 5.7230 5.2857 4.1239 2.8592 2.0743 2.1298 5.7229 4.1984 4.2123 2.0846 1.7014 3.7167 3.1805 1.1598 3.3809 1.2569 1.2516 1.2401 1.2718 3.6475 1.3608 2.8116 1.3603 1.9143 1.3557 1.3569 1.4876 1.3840 1.3849 1.6205 2.1196 1.5128 1.3439 6.1553 5.2607 4.1425 2.2165 2.7287 2.7122 1.6239 1.5735 1.9876 1.1029 1.1018 2.3986 1.1453 1.1859 1.5424 1.6835 1.8626 2.4920 1.3719 1.2095 3.0371 1.2078 3.7909 1.5341 1.4701 1.2170 1.3035 2.4867 1.0533 1.0489 1.0485 1.2979 1.0494 1.0476 2.1980 1.0432 2.2790 2.1494 2.1432 5.4296 5.6863 5.6365 5.3820 3.7591 6.0593 13.0291 1.0830 1.0331 1.0330 1.0332 1.0831 1.1050 1.0603 1.1038 1.1044 1.1039 1.1041 1.1037 1.0888 1.0867 1.0913 1.1095 1.0872 1.0956 1.0899 1.0924 1.0941 1.0964 1.0967 1.1029
irintensity: 1.4950 3.1168 2.7050 0.5735 1.0411 0.8977 0.4685 0.3657 1.1853 3.0393 0.3695 2.1066 1.3039 2.8499 2.4668 0.2383 0.3130 1.5132 2.3673 0.0454 0.5033 0.4006 1.1353 1.5064 0.4698 13.7955 2.3620 6.0259 5.0650 5.0354 0.6482 0.4737 2.0494 9.5324 3.2456 8.7630 59.2213 28.3412 0.1812 35.7844 10.0728 6.8688 5.8101 6.9301 9.7051 34.9748 15.1502 90.2607 13.0117 14.7775 91.4433 67.7989 70.3640 0.9071 0.0083 7.1849 2.2316 1.4492 6.1967 9.0868 24.8268 72.3307 13.1882 13.6456 7.8396 0.1803 2.3794 6.0769 42.1076 68.6524 14.5555 26.8073 184.1871 1.0564 2.4569 4.9057 13.7449 0.9255 20.9697 73.9276 7.7690 12.0905 3.0310 0.0286 0.2840 6.5582 4.9973 2.9020 101.7680 220.9821 27.8355 108.5766 18.9005 9.7080 3.6481 9.0532 8.5422 10.7087 9.8726 2.7511 4.1281 68.8609 0.9767 0.1857 0.3263 1.1338 17.3078 18.1784 11.5615 9.3478 14.6617 14.0437 15.0754 1.8447 52.2774 4.4016 4.8997 9.7513 253.1260 524.6538 2.2912 4.2071 15.2177 4.9189 4.0161 0.5100 91.1394 17.4448 11.1758 3.6097 5.6610 2.6294 14.6232 0.4194 27.3832 30.9128 0.2756 38.9022 4.7811 9.2089 7.5488 10.0481 2.5474 26.0601
temp: 298.150 k
press: 1.00000 atm
elementType: 15 79 6 1 1 1 6 1 1 1 6 1 1 1 6 6 1 6 1 1 6 6 6 6 1 6 1 6 1 1 1 7 6 1 6 8 8 6 1 6 6 6 6 1 6 1 6 1 1 1
symmnumber: 1
zpe: 1063030.5 jmol-1
zpe.correction: 0.404887 hartree
zpe.thermalcorrener: 0.431766 hartree
zpe.thermalcorrenthalpy: 0.432711 hartree
zpe.thermalcorrgfe: 0.344797 hartree
zpe.sumelectzpe: -1496.514622 hartree
zpe.sumelectthermal: -1496.487743 hartree
zpe.sumelectthermalent: -1496.486798 hartree
zpe.sumelectthermalfe: -1496.574712 hartree
dipole: -2.0988 0.7823 7.5131
dipole: 7.8399
quadrupole: -156.8186 -154.8182 -69.5379
quadrupole: 3.5913 17.1115 0.1525
quadrupole: -29.7604 -27.7599 57.5203 3.5913 17.1115 0.1525
hfenergy: -1496.919509 hartree
pointgroup: C01 [X(C21H24Au1N1O2P1)]
dipole: -0.6629708 0.4799281 1.7837238 debye
polarizability: 410.6898573|1.9290007|345.6008923|-14.6937571|3.0572458|321.5057948 unknown
InChI: InChI=1/C18H15NO2.C3H9P.Au/c1-2-16(14-9-5-3-6-10-14)17-18(20)21-13-19(17)15-11-7-4-8-12-15;1-4(2)3;/h3-13,16-17H,1H2;1-3H3;/rC21H24AuNO2P/c1-16(22-26(2,3)4)19(17-11-7-5-8-12-17)20-21(24)25-15-23(20)18-13-9-6-10-14-18/h5-15,19-20H,1H2,2-4H3
charge 1 multiplicity 1
50 atoms
P  -0.61688985 0.30339624 -4.01600322
Au 0.38097533 0.28827505 -1.88489072
C  -1.70932126 1.74694424 -4.33752678
H  -1.12645418 2.67005482 -4.26865817
H  -2.15614641 1.67194414 -5.33448462
H  -2.50279613 1.7773733 -3.58520683
C  -1.69894243 -1.14843086 -4.33472378
H  -2.49094715 -1.18460639 -3.58112022
H  -2.14723052 -1.07822554 -5.33133829
H  -1.1085096 -2.06664109 -4.26505022
C  0.55482203 0.30583107 -5.43255265
H  1.1927576 -0.58096056 -5.37846176
H  0.00796113 0.30329001 -6.38140478
H  1.18825045 1.19597577 -5.38059663
C  1.23286491 0.25884729 0.01270098
C  0.80588336 -0.92062822 0.87350851
H  1.13055989 -1.82418103 0.33802874
C  2.09748443 1.20035491 0.42370194
H  2.40982701 2.00842203 -0.23274856
H  2.5575051 1.2376683 1.41079409
C  -0.70849985 -1.03898077 1.05508581
C  -1.53577941 0.09121846 1.05522952
C  -1.28493442 -2.30022824 1.25548485
C  -2.90931324 -0.035625 1.2669505
H  -1.0985373 1.07169168 0.90259793
C  -2.65884986 -2.43035239 1.46773277
H  -0.65637962 -3.18890156 1.24500535
C  -3.4747955 -1.2959113 1.47649554
H  -3.5347502 0.85242183 1.27726482
H  -3.09032674 -3.41549783 1.62097475
H  -4.54362396 -1.39433995 1.64378413
N  1.3658653 -0.11324742 3.31773309
C  1.51785275 -1.13936586 2.25699535
H  1.14914669 -2.08635762 2.66614888
C  3.02604732 -1.24175755 2.1601216
O  3.74469137 -1.88369725 1.47425328
O  3.55988275 -0.35298173 3.18251061
C  2.53552339 0.22336465 3.77296175
H  2.70991407 0.93343207 4.57252569
C  0.11726258 0.42183135 3.79815386
C  -0.84558798 -0.45221031 4.30403607
C  -0.09265072 1.79813869 3.71875655
C  -2.05919122 0.07697354 4.73534594
H  -0.65757352 -1.51910517 4.34717439
C  -1.31032997 2.31272005 4.16601908
H  0.66413119 2.44367036 3.28518306
C  -2.29117035 1.45481203 4.667717
H  -2.82392728 -0.58855071 5.12152697
H  -1.49317017 3.38064866 4.10667554
H  -3.24172391 1.85854487 5.00208317
