program: Gaussian 09
title: Opt freq
version: EM64L-G09RevD.01
method: UB3LYP
basis: 6-31G(d)
operation: Freq
keyword: #P
keyword: Geom=AllCheck
keyword: Guess=TCheck
keyword: SCRF=Check
keyword: GenChk
keyword: UB3LYP/6-31G(d)
keyword: Freq
converged: YES YES NO NO
polarizability: 1.00615186e+02 -1.17480449e+01 3.54206579e+02 3.59119446e-01 9.17789966e-01 4.08622529e+02
1716.lowfreq: -6.3110 -1.9700 0.0006 0.0006 0.0008 3.1474 51.2025 57.5005 69.5213
frequency: 51.1817 57.4421 69.5146 74.7579 111.7096 145.9519 162.3477 195.6401 234.5560 286.7430 296.3271 316.9037 367.6563 418.8800 420.1710 433.2329 447.1577 457.7577 512.3952 520.2836 573.3169 577.4125 623.0796 628.4217 634.7394 660.2155 702.6399 735.2457 742.3695 760.0274 766.3059 786.3229 791.0875 812.1949 842.1002 860.9823 882.9807 891.6620 930.6535 944.8668 945.3615 953.1024 975.8966 977.6507 984.3637 985.6854 1012.9802 1025.3103 1038.0904 1052.6609 1060.8453 1071.0223 1123.1771 1127.8624 1161.8959 1187.2572 1188.5135 1201.7112 1229.9441 1237.7333 1241.2445 1247.3386 1310.9376 1334.7752 1341.5289 1350.4657 1358.3153 1400.6222 1406.5389 1439.6244 1454.6645 1484.6191 1485.1123 1506.5559 1511.7199 1514.3190 1520.2190 1556.9669 1598.9773 1614.7185 1617.1169 1630.6302 1642.2440 1658.0290 3038.3719 3096.6415 3125.4036 3179.4748 3180.6633 3181.7104 3183.2805 3190.6657 3191.8876 3204.2060 3204.8320 3210.6106 3211.6808 3216.6985 3217.7699
redmass: 4.0337 1.0587 3.8793 3.7893 4.6126 3.8022 4.2443 4.9337 4.4392 4.7396 5.4177 4.4487 2.9745 3.4167 3.4430 4.8485 4.1191 3.4446 3.4745 4.2890 3.6190 5.5331 4.6738 6.3830 6.0335 6.6682 5.7352 3.8933 1.6763 1.4410 5.4348 2.1796 2.9680 5.1626 1.5436 1.2489 1.3413 1.4648 5.3744 1.3767 1.3953 6.5518 1.3030 1.2866 1.2945 1.2687 7.0757 1.4254 2.8457 2.2881 1.8425 1.5303 2.3549 1.9645 1.3748 1.8252 1.1960 1.3948 1.3293 2.3408 2.2761 2.5221 2.4863 1.7808 3.2857 4.1690 1.3997 5.5941 3.1652 1.2370 2.4863 2.6774 2.1781 2.0205 1.1968 1.1101 3.1219 2.5447 4.7477 5.4487 4.9241 6.0097 5.6528 5.4632 1.0409 1.0955 1.1032 1.0889 1.0889 1.0866 1.0862 1.0891 1.0895 1.0929 1.0930 1.0942 1.0948 1.0932 1.0936
irintensity: 0.5350 0.3973 0.0842 0.0416 1.3793 0.0016 0.2928 0.1202 0.4340 0.0753 0.0560 0.8648 0.4130 3.0478 0.9068 1.8261 0.4916 0.0029 5.8049 1.4399 0.3283 10.4566 6.7803 1.2055 5.3238 0.0232 3.9935 0.7698 82.3287 0.2120 0.9786 30.6896 0.0080 1.0005 38.6738 4.0105 0.0103 0.0419 1.5461 3.6176 0.2931 3.8432 1.3883 0.3204 1.8450 0.9625 1.6773 0.8538 2.5383 1.6271 5.3234 25.0625 0.1302 5.1699 8.3569 0.5656 0.1643 0.1082 12.8641 7.3841 0.7004 0.3490 10.0082 0.7538 4.4648 5.2160 3.1294 53.1179 37.4828 4.6355 1.2382 6.0821 54.2026 0.8686 11.3633 12.9729 1.3858 8.4857 2.5337 15.7522 0.3510 6.1959 27.5195 18.8011 50.1101 26.7023 21.7836 24.5513 41.3424 0.4424 2.0606 16.2162 14.9482 26.8533 72.5910 21.1860 3.8178 73.1651 3.7406
temp: 298.150 k
press: 1.00000 atm
elementType: 6 6 6 6 6 6 1 6 1 1 6 6 6 6 1 6 1 6 1 1 6 6 6 6 1 6 6 1 1 6 1 1 1 1 1
symmnumber: 1
zpe: 748440.5 jmol-1
zpe.correction: 0.285066 hartree
zpe.thermalcorrener: 0.300310 hartree
zpe.thermalcorrenthalpy: 0.301255 hartree
zpe.thermalcorrgfe: 0.241491 hartree
zpe.sumelectzpe: -770.916845 hartree
zpe.sumelectthermal: -770.901600 hartree
zpe.sumelectthermalent: -770.900656 hartree
zpe.sumelectthermalfe: -770.960419 hartree
dipole: 0.0270 0.0393 1.4372
dipole: 1.4380
quadrupole: -119.2222 -103.3173 -94.3779
quadrupole: -2.3389 0.1339 0.2212
quadrupole: -13.5831 2.3219 11.2612 -2.3389 0.1339 0.2212
hfenergy: -771.2019106 hartree
pointgroup: C01 [X(C20H15)]
dipole: 0.0106274 0.015464 0.5654499 debye
polarizability: 100.6151865|-11.7480449|354.2065786|0.3591194|0.91779|408.6225289 unknown
InChI: InChI=1/C20H15/c1-14-10-12-15(13-11-14)20-18-8-4-2-6-16(18)17-7-3-5-9-19(17)20/h2-13H,1H3
charge 0 multiplicity 2
35 atoms
C  -0.00141481 -0.00200028 -0.09496366
C  -0.03794962 -1.16426965 -0.96009772
C  -0.02597669 -0.72692732 -2.32090176
C  -0.14487424 -2.53427439 -0.6740062
C  -0.08197616 -1.64395632 -3.3628013
C  -0.19643379 -3.44773239 -1.72930252
H  -0.20303616 -2.88333852 0.35197549
C  -0.15895426 -3.01133445 -3.06120449
H  -0.07381662 -1.30970401 -4.39723705
H  -0.27440811 -4.5100007 -1.51453226
C  -0.00237042 -0.00504523 1.35989574
C  -0.7409481 0.94864995 2.09452253
C  0.73176943 -0.96286676 2.0921168
C  -0.7436077 0.93851962 3.48500373
H  -1.34986463 1.67299182 1.56292189
C  0.72897969 -0.95967141 3.48344114
H  1.33657291 -1.68990278 1.55957317
C  -0.00593898 -0.01075755 4.20888545
H  -1.33690068 1.67540555 4.02182054
H  1.3140754 -1.70400206 4.01877384
C  0.03702606 1.16490809 -0.95379199
C  0.14248793 2.53338709 -0.65999887
C  0.02888631 0.73490811 -2.31691507
C  0.196563 3.45255307 -1.71020427
H  0.1973036 2.87696371 0.36803813
C  0.08750525 1.65755943 -3.35370363
C  0.16311939 3.02332072 -3.04454125
H  0.08231665 1.32888097 -4.38994138
H  0.27333499 4.51369089 -1.48948918
C  0.01625797 0.00883553 5.71785791
H  0.77054671 0.71490585 6.09055054
H  -0.94976435 0.32178477 6.12883503
H  0.26028062 -0.97620548 6.12901644
H  0.20776469 3.75450279 -3.84693302
H  -0.20162428 -3.73816983 -3.86764496
