program: Gaussian 09
title: Opt freq
version: EM64L-G09RevD.01
method: UB3LYP
basis: 6-31G(d)
operation: Freq
keyword: #P
keyword: Geom=AllCheck
keyword: Guess=TCheck
keyword: SCRF=Check
keyword: GenChk
keyword: UB3LYP/6-31G(d)
keyword: Freq
converged: YES YES NO NO
polarizability: 1.03488773e+02 -1.25517505e+01 3.67822518e+02 3.72759529e-01 9.51677237e-01 4.21385483e+02
1716.lowfreq: -6.4728 -3.2434 -0.0010 -0.0008 -0.0004 2.8352 51.1280 57.0177 69.5275
frequency: 51.1045 56.9631 69.5195 74.4671 111.6302 146.0865 162.2975 195.7153 234.5589 286.7762 296.3092 316.8434 367.6524 418.7895 420.0790 433.1942 447.1305 457.7719 512.3272 520.2442 573.3568 577.2272 623.0728 628.3725 634.5797 660.0341 702.4224 735.1063 742.3847 760.2760 766.1095 786.3438 791.0309 812.0730 842.1290 861.1000 883.4122 892.1701 930.3890 945.8082 946.4810 952.8645 976.8854 978.4520 985.1113 986.2660 1012.7118 1025.3335 1037.7736 1052.4935 1060.7016 1070.7324 1122.9783 1127.7217 1161.7053 1186.9625 1188.0996 1201.3308 1229.6054 1237.5273 1240.9315 1247.2016 1310.7343 1334.8395 1341.3979 1350.1431 1358.2531 1400.1812 1406.2988 1438.9177 1454.2772 1484.3432 1484.8437 1506.0801 1510.7102 1513.3286 1519.9127 1556.6704 1598.5066 1614.2346 1616.6602 1630.1982 1641.8288 1657.4771 3038.5800 3096.8919 3125.8101 3180.1376 3181.3384 3182.3868 3183.9084 3191.2158 3192.3795 3204.6329 3205.2465 3210.9066 3211.9892 3216.9965 3218.0937
redmass: 3.9962 1.0587 3.9181 3.7855 4.6132 3.8028 4.2451 4.9348 4.4392 4.7387 5.4186 4.4493 2.9741 3.4164 3.4424 4.8535 4.1148 3.4435 3.4718 4.2873 3.6177 5.5262 4.6811 6.3668 6.0347 6.6644 5.7367 3.8962 1.6818 1.4463 5.4114 2.1735 2.9678 5.1654 1.5432 1.2484 1.3404 1.4612 5.3958 1.3765 1.3966 6.5262 1.3043 1.2874 1.2935 1.2679 7.0694 1.4256 2.8465 2.2904 1.8437 1.5312 2.3554 1.9633 1.3750 1.8172 1.1950 1.3979 1.3268 2.3418 2.2761 2.5343 2.4955 1.7813 3.2924 4.1578 1.3988 5.5952 3.1658 1.2367 2.4808 2.6749 2.1733 1.9038 1.2340 1.1177 3.1189 2.5421 4.7553 5.4459 4.9207 6.0097 5.6481 5.4678 1.0409 1.0955 1.1033 1.0889 1.0889 1.0867 1.0862 1.0891 1.0895 1.0929 1.0930 1.0942 1.0948 1.0933 1.0936
irintensity: 0.5651 0.4196 0.0937 0.0495 1.4630 0.0028 0.3027 0.1402 0.4445 0.0876 0.0498 0.8994 0.4471 3.2849 0.9691 1.9527 0.5310 0.0010 6.1845 1.5354 0.3852 11.3741 7.0905 1.3483 5.8017 0.0331 4.2252 0.8196 85.8531 0.2414 1.0839 32.4069 0.0070 1.0043 41.0607 4.2293 0.0125 0.0456 1.8146 3.8898 0.3183 4.0246 1.5373 0.3684 1.8447 0.9739 1.9089 0.9550 2.7745 1.7687 5.8374 26.5112 0.1059 5.4521 9.0650 0.6771 0.1745 0.1259 13.9211 7.9402 0.7836 0.3943 10.6093 0.8664 4.6919 5.3919 3.3402 57.1727 40.4728 5.0382 1.2541 6.2499 57.8585 1.3184 11.6684 14.0363 1.4970 8.4860 2.6221 17.3585 0.4141 6.4711 30.1029 20.6646 51.1760 27.7607 23.2297 25.5404 43.1099 0.4489 2.3679 16.8728 15.9534 27.6738 75.4629 21.8199 4.3140 78.9426 3.8329
temp: 298.150 k
press: 1.00000 atm
elementType: 6 6 6 6 6 6 1 6 1 1 6 6 6 6 1 6 1 6 1 1 6 6 6 6 1 6 6 1 1 6 1 1 1 1 1
symmnumber: 1
zpe: 748426.1 jmol-1
zpe.correction: 0.285060 hartree
zpe.thermalcorrener: 0.300307 hartree
zpe.thermalcorrenthalpy: 0.301251 hartree
zpe.thermalcorrgfe: 0.241474 hartree
zpe.sumelectzpe: -770.917478 hartree
zpe.sumelectthermal: -770.902232 hartree
zpe.sumelectthermalent: -770.901288 hartree
zpe.sumelectthermalfe: -770.961064 hartree
dipole: 0.0275 0.0404 1.4745
dipole: 1.4753
quadrupole: -119.2278 -102.9922 -93.8254
quadrupole: -2.3733 0.1359 0.2250
quadrupole: -13.8793 2.3562 11.5231 -2.3733 0.1359 0.2250
hfenergy: -771.2025387 hartree
pointgroup: C01 [X(C20H15)]
dipole: 0.0108286 0.0158892 0.5801206 debye
polarizability: 103.4887727|-12.5517505|367.8225184|0.3727595|0.9516772|421.3854828 unknown
InChI: InChI=1/C20H15/c1-14-10-12-15(13-11-14)20-18-8-4-2-6-16(18)17-7-3-5-9-19(17)20/h2-13H,1H3
charge 0 multiplicity 2
35 atoms
C  -0.0014229 -0.0020059 -0.09479298
C  -0.03766818 -1.16433131 -0.96007203
C  -0.0258983 -0.72694869 -2.32096822
C  -0.14417575 -2.53452142 -0.67410346
C  -0.08196396 -1.64390815 -3.36309936
C  -0.19578947 -3.44791679 -1.72955904
H  -0.20164467 -2.88406634 0.35173251
C  -0.15871125 -3.01139358 -3.06154425
H  -0.07400597 -1.30963187 -4.39750425
H  -0.27335218 -4.51019623 -1.51481372
C  -0.00238499 -0.00505486 1.36009103
C  -0.74001901 0.94949479 2.09478225
C  0.73081876 -0.96372388 2.09236996
C  -0.74269198 0.93936704 3.48531699
H  -1.3481591 1.67471949 1.56352841
C  0.72806063 -0.96051633 3.48374929
H  1.33486146 -1.69161831 1.56016659
C  -0.00593213 -0.01075192 4.20924324
H  -1.33515904 1.67690907 4.0220636
H  1.31231652 -1.70550836 4.01900124
C  0.0367338 1.16496205 -0.95376147
C  0.14178496 2.53362515 -0.66008377
C  0.0288009 0.73492796 -2.3169781
C  0.1959255 3.45273299 -1.71044509
H  0.19591458 2.87767783 0.36780951
C  0.08749521 1.65751497 -3.35399418
C  0.16288362 3.0233819 -3.04486662
H  0.08251058 1.32881742 -4.39020204
H  0.27229434 4.51388028 -1.48975145
C  0.01619358 0.00875068 5.71818303
H  0.77114608 0.71421677 6.09062126
H  -0.94948882 0.3228671 6.1289796
H  0.25950385 -0.97648113 6.12921545
H  0.20756039 3.75449498 -3.84728341
H  -0.20140603 -3.73815657 -3.86801276
