program: Gaussian 09
title: Opt freq
version: EM64L-G09RevD.01
method: UB3LYP
basis: 6-31G(d)
operation: Freq
keyword: #P
keyword: Geom=AllCheck
keyword: Guess=TCheck
keyword: SCRF=Check
keyword: GenChk
keyword: UB3LYP/6-31G(d)
keyword: Freq
converged: YES YES NO NO
polarizability: 1.10506569e+02 -1.44195701e+01 3.97761915e+02 4.22501942e-01 1.00987168e+00 4.48674619e+02
1716.lowfreq: -6.6217 -5.8401 -0.0005 -0.0003 0.0005 1.0765 50.8175 55.3300 69.6107
frequency: 50.7867 55.2893 69.5989 73.6676 111.5171 145.9599 162.1696 195.8858 234.6988 286.7019 296.2695 316.6429 368.0122 418.5751 419.8905 433.0439 447.0367 457.5725 512.2200 520.1740 573.4163 576.8986 623.0398 628.2473 634.2488 659.6339 701.9526 734.8207 742.3730 760.6598 765.6947 786.3888 790.8187 811.7942 842.3440 861.5711 884.4363 893.1598 929.7972 947.9580 948.7298 952.3306 979.1034 980.2818 987.0331 987.9033 1012.1309 1025.5856 1037.1328 1052.1135 1060.3282 1070.1165 1122.5811 1127.4256 1161.3052 1186.3130 1187.2215 1200.5730 1228.9279 1237.0432 1240.2283 1246.9321 1310.2524 1334.9367 1341.0860 1349.4375 1358.2639 1399.1888 1405.7456 1437.5108 1453.4285 1483.6987 1484.2029 1504.8143 1508.7343 1511.4189 1519.2322 1556.0451 1597.4327 1613.1493 1615.6366 1629.2076 1640.8863 1656.2429 3039.0606 3097.4524 3126.8059 3181.6951 3183.0096 3183.9051 3185.3198 3192.4844 3193.5157 3205.6608 3206.2466 3211.6078 3212.7199 3217.7708 3218.9071
redmass: 3.7655 1.0678 4.0373 3.7841 4.6141 3.8016 4.2460 4.9367 4.4418 4.7304 5.4242 4.4524 2.9750 3.4136 3.4397 4.8602 4.1096 3.4414 3.4739 4.2746 3.6136 5.5185 4.6928 6.3400 6.0385 6.6561 5.7397 3.9086 1.6953 1.4625 5.3610 2.1595 2.9456 5.1716 1.5414 1.2479 1.3379 1.4548 5.4458 1.3761 1.4050 6.3551 1.3063 1.2883 1.2916 1.2674 7.0442 1.4252 2.8525 2.2953 1.8460 1.5333 2.3570 1.9611 1.3761 1.8029 1.1927 1.4037 1.3230 2.3427 2.2738 2.5557 2.5178 1.7828 3.3117 4.1235 1.3967 5.5968 3.1680 1.2360 2.4656 2.6694 2.1620 1.6183 1.3600 1.1441 3.1109 2.5333 4.7689 5.4382 4.9121 6.0109 5.6375 5.4766 1.0410 1.0954 1.1034 1.0889 1.0889 1.0868 1.0864 1.0891 1.0895 1.0929 1.0930 1.0942 1.0947 1.0933 1.0937
irintensity: 0.6576 0.4584 0.1313 0.0675 1.6523 0.0093 0.3290 0.1934 0.4660 0.1143 0.0339 0.9847 0.5416 3.8838 1.1278 2.2607 0.6281 0.0035 7.0473 1.7976 0.5184 13.4677 7.8536 1.7029 6.9744 0.0686 4.7305 0.9331 94.5364 0.2900 1.3500 36.7722 0.0058 1.0006 47.0021 4.6831 0.0199 0.0526 2.5263 4.5931 0.3853 4.3653 1.8683 0.4726 1.8438 0.9842 2.4269 1.2380 3.3349 2.1171 6.9812 29.9288 0.0586 6.0597 10.7332 0.9399 0.1868 0.1681 16.4440 9.1889 0.9850 0.4914 11.7462 1.1151 5.1181 5.7136 3.7770 66.3222 47.5324 5.9295 1.2727 6.6603 65.8763 3.7845 10.9678 16.9268 1.7509 8.3932 2.7950 21.2486 0.5783 7.0076 36.4833 24.8825 53.1352 30.3793 26.8145 28.3729 46.2043 0.4749 3.0679 18.2518 18.2430 29.1743 81.2905 22.9590 5.6091 91.9184 3.7777
temp: 298.150 k
press: 1.00000 atm
elementType: 6 6 6 6 6 6 1 6 1 1 6 6 6 6 1 6 1 6 1 1 6 6 6 6 1 6 6 1 1 6 1 1 1 1 1
symmnumber: 1
zpe: 748401.9 jmol-1
zpe.correction: 0.285051 hartree
zpe.thermalcorrener: 0.300304 hartree
zpe.thermalcorrenthalpy: 0.301248 hartree
zpe.thermalcorrgfe: 0.241426 hartree
zpe.sumelectzpe: -770.918884 hartree
zpe.sumelectthermal: -770.903631 hartree
zpe.sumelectthermalent: -770.902687 hartree
zpe.sumelectthermalfe: -770.962510 hartree
dipole: 0.0289 0.0427 1.5505
dipole: 1.5514
quadrupole: -119.2447 -102.2320 -92.5856
quadrupole: -2.4536 0.1415 0.2314
quadrupole: -14.5573 2.4555 12.1018 -2.4536 0.1415 0.2314
hfenergy: -771.2039353 hartree
pointgroup: C01 [X(C20H15)]
dipole: 0.0113625 0.0168052 0.6100275 debye
polarizability: 110.5065695|-14.4195701|397.7619148|0.4225019|1.0098717|448.6746195 unknown
InChI: InChI=1/C20H15/c1-14-10-12-15(13-11-14)20-18-8-4-2-6-16(18)17-7-3-5-9-19(17)20/h2-13H,1H3
charge 0 multiplicity 2
35 atoms
C  -0.00132883 -0.00193996 -0.09443201
C  -0.03691737 -1.16442795 -0.95999627
C  -0.02569297 -0.72698899 -2.32112021
C  -0.1424308 -2.53503204 -0.67423265
C  -0.08189092 -1.64385164 -3.36372316
C  -0.1941986 -3.44832298 -1.73000759
H  -0.1982661 -2.88563675 0.35128389
C  -0.15808584 -3.01156729 -3.06218524
H  -0.07434031 -1.30960459 -4.39808369
H  -0.27075372 -4.51061417 -1.51525627
C  -0.00227055 -0.00497838 1.36050514
C  -0.73758331 0.95163816 2.09537014
C  0.72862791 -0.96572155 2.09291503
C  -0.74033792 0.9414354 3.48601699
H  -1.34375507 1.67906906 1.56495057
C  0.72587158 -0.9625681 3.48440868
H  1.33079961 -1.69569052 1.56149837
C  -0.00590695 -0.01080254 4.21002413
H  -1.3307733 1.68057425 4.02261934
H  1.30807318 -1.70919913 4.01943232
C  0.03608019 1.16514697 -0.9537446
C  0.14018845 2.53423622 -0.66034393
C  0.02853014 0.73499201 -2.31716686
C  0.19437925 3.45318999 -1.71107638
H  0.19283685 2.87939287 0.36720817
C  0.08724711 1.65743462 -3.35470456
C  0.16213319 3.02354506 -3.04566431
H  0.08254492 1.32872186 -4.39085186
H  0.26979001 4.51435749 -1.4904388
C  0.01584485 0.00835631 5.71889197
H  0.7726976 0.71191262 6.09097407
H  -0.94891524 0.32575969 6.12913475
H  0.25679062 -0.9774971 6.12963052
H  0.20674749 3.75449655 -3.84814286
H  -0.2008041 -3.73820663 -3.86867506
