program: Gaussian 09
title: Opt freq
version: EM64L-G09RevD.01
method: UB3LYP
basis: 6-31G(d)
operation: Freq
keyword: #P
keyword: Geom=AllCheck
keyword: Guess=TCheck
keyword: SCRF=Check
keyword: GenChk
keyword: UB3LYP/6-31G(d)
keyword: Freq
converged: YES YES YES YES
polarizability: 1.03786155e+02 1.24214704e+01 4.63271147e+02 -3.29508269e+00 3.81060402e-01 2.48130152e+02
1716.lowfreq: -6.2287 -1.3068 0.0005 0.0006 0.0009 6.7974 30.4795 43.7259 64.3249
frequency: 30.4750 43.7224 64.3202 76.6167 90.0704 108.5067 122.9098 169.7598 183.5528 204.2348 233.7277 257.3116 275.0782 307.2590 319.7160 345.5237 392.2652 420.7098 427.2182 427.4874 438.8463 510.0671 513.0184 524.4789 552.6096 606.2696 608.9325 633.7872 646.3661 651.2907 728.2765 734.3486 799.3558 819.6388 822.9529 826.0723 848.8648 855.6441 939.1770 956.4586 957.8099 970.5299 993.6544 1022.1903 1023.5205 1054.2130 1059.4416 1088.1797 1159.4744 1168.4590 1183.2194 1183.4368 1211.3248 1217.6757 1218.4980 1226.0408 1275.9632 1303.4049 1311.0739 1325.1315 1348.4381 1352.6634 1362.3115 1364.7800 1469.5515 1481.6910 1498.7901 1499.0786 1518.8231 1519.0998 1526.9697 1527.7069 1548.4421 1553.1536 1593.2111 1599.0626 1640.9315 1654.0648 2240.3374 3037.1711 3037.5753 3103.5129 3103.6852 3168.2864 3168.3127 3202.4477 3202.7803 3209.0171 3210.7574 3224.8908 3229.3726 3234.2891 3234.5737
redmass: 3.6007 4.6297 5.6858 3.8380 3.7898 3.9739 9.2260 4.6290 4.6968 4.2208 2.3567 1.1848 1.5113 5.0548 3.9416 4.2105 7.5280 3.3011 4.4179 5.9152 4.5419 3.7755 3.7535 3.8741 2.8107 6.7648 4.8585 6.0663 6.7234 6.7200 4.7456 4.8458 5.5651 5.4901 1.2676 1.3276 1.7129 1.5355 6.0508 1.3112 1.3265 1.3089 1.2438 3.1179 2.8114 7.5876 5.6484 4.1617 1.3590 1.4608 1.2688 1.2692 1.2816 1.3713 1.3476 1.2251 3.7754 3.8976 4.2639 2.7586 2.6447 2.5080 2.6082 2.1354 3.0901 3.1724 1.1979 1.2103 1.0455 1.0452 1.0691 1.0717 2.2140 2.2067 5.7047 5.9589 4.9431 5.2836 12.6893 1.0335 1.0335 1.1077 1.1076 1.1018 1.1018 1.0891 1.0893 1.0881 1.0887 1.0945 1.0933 1.0923 1.0924
irintensity: 3.4534 1.6734 3.6271 0.0529 0.2514 10.8557 9.4507 1.6589 0.9092 0.2636 0.5291 0.0025 0.1436 0.9437 2.7130 2.6727 8.5914 0.6025 9.6429 30.7186 0.0009 0.0953 23.6659 43.5281 4.2939 13.5620 22.7798 20.3235 6.8447 3.9745 0.9292 2.6652 5.1340 9.5661 10.0407 8.3514 120.6625 12.1795 0.5933 0.2614 1.4878 1.1509 0.0055 0.0417 1.9974 9.0258 245.1063 1.3061 8.2241 19.6891 1.1994 1.1928 656.9774 37.8954 3.8750 11.7853 3.2698 905.3692 75.1496 61.5682 364.4720 9.9386 222.0713 2.2792 0.1307 6.0160 22.1107 71.7890 8.8453 8.8305 119.7127 18.0477 117.3952 34.3500 5.9286 25.3411 793.5816 60.1612 110.6004 167.5684 34.0783 40.2486 44.3799 34.3966 26.3915 2.9826 10.5822 15.4817 5.6451 4.6081 10.2445 32.0308 3.2424
temp: 298.150 k
press: 1.00000 atm
elementType: 6 6 6 6 6 1 6 1 6 1 1 6 6 6 6 1 6 1 6 1 6 1 1 1 1 8 8 6 1 1 1 6 7
symmnumber: 1
zpe: 688665.9 jmol-1
zpe.correction: 0.262299 hartree
zpe.thermalcorrener: 0.279231 hartree
zpe.thermalcorrenthalpy: 0.280176 hartree
zpe.thermalcorrgfe: 0.216025 hartree
zpe.sumelectzpe: -823.050623 hartree
zpe.sumelectthermal: -823.033690 hartree
zpe.sumelectthermalent: -823.032746 hartree
zpe.sumelectthermalfe: -823.096896 hartree
dipole: 0.0947 0.0037 -4.0848
dipole: 4.0859
quadrupole: -110.5358 -56.2804 -129.8190
quadrupole: 8.4601 0.4383 0.3003
quadrupole: -11.6574 42.5980 -30.9406 8.4601 0.4383 0.3003
hfenergy: -823.3129215 hartree
pointgroup: C01 [X(C16H14N1O2)]
dipole: 0.0372504 0.0014471 -1.6070953 debye
polarizability: 103.7861545|12.4214704|463.2711473|-3.2950827|0.3810604|248.1301522 unknown
InChI: InChI=1/C16H14NO2/c1-18-14-7-3-12(4-8-14)16(11-17)13-5-9-15(19-2)10-6-13/h3-10H,1-2H3
charge 0 multiplicity 2
33 atoms
C  -0.02383088 -0.02038593 1.20978126
C  0.0375687 -1.31375257 0.54499405
C  0.60837801 -1.47044426 -0.74443223
C  -0.4289315 -2.48243204 1.1886792
C  0.67796526 -2.70970724 -1.35418885
H  1.03305442 -0.6108452 -1.25096693
C  -0.36508375 -3.73167119 0.5830974
H  -0.86346043 -2.4054981 2.18098533
C  0.18486461 -3.85508383 -0.70292782
H  1.12823378 -2.82515246 -2.3350568
H  -0.74641486 -4.59615833 1.11330707
C  -0.05432177 1.27357846 0.54400886
C  0.38301527 2.44148896 1.20915611
C  -0.56602803 1.4317862 -0.76978939
C  0.34756077 3.69128992 0.60243063
H  0.77197823 2.36352359 2.22011405
C  -0.60712529 2.67162565 -1.38095262
H  -0.96834391 0.57312564 -1.29574746
C  -0.14346944 3.8162563 -0.70715614
H  -1.01259497 2.78802314 -2.38106806
C  -0.17090115 -6.22107183 -0.77822843
H  -1.2458061 -6.16781862 -0.56640274
H  0.37465833 -6.43298607 0.14939072
H  0.70510224 4.5550104 1.1502153
H  0.01833633 -7.01559324 -1.50112918
O  0.29648751 -5.01947981 -1.3911964
O  -0.22320585 4.98111184 -1.39876173
C  0.21542276 6.18241853 -0.7642779
H  0.0585265 6.97749708 -1.49427312
H  1.27973431 6.12960251 -0.50430452
H  -0.3714786 6.39309172 0.13802834
C  -0.05656954 -0.02089416 2.62343794
N  -0.08369306 -0.02126529 3.79416807
