program: Gaussian 09
title: Opt freq
version: EM64L-G09RevD.01
method: UB3LYP
basis: 6-31G(d)
operation: Freq
keyword: #P
keyword: Geom=AllCheck
keyword: Guess=TCheck
keyword: SCRF=Check
keyword: GenChk
keyword: UB3LYP/6-31G(d)
keyword: Freq
converged: YES YES YES YES
polarizability: 1.10570387e+02 1.34064974e+01 4.92202926e+02 -3.58277187e+00 4.06355121e-01 2.68036179e+02
1716.lowfreq: -7.2488 -1.9112 -0.0004 -0.0003 0.0004 6.3645 29.8701 43.6477 63.5475
frequency: 29.8658 43.6444 63.5429 76.1267 89.8565 108.5040 123.0640 169.6114 183.1855 203.8347 233.2675 256.3790 274.3671 307.0224 319.3484 344.9947 393.0419 420.7101 427.0077 427.2332 438.8702 509.8680 513.1638 524.4131 552.4519 606.3794 608.9943 633.5449 646.0203 650.8937 728.0521 734.0792 799.0838 819.2616 822.6416 825.6848 848.0627 854.9237 938.7914 957.0968 958.3195 971.1212 994.2410 1021.5988 1022.8359 1051.0231 1055.8335 1087.6124 1159.2580 1168.2142 1182.5802 1182.9248 1209.9891 1217.2709 1218.1372 1225.3569 1276.1886 1301.9970 1309.4716 1324.7705 1347.5394 1352.0738 1362.1352 1364.5803 1469.2390 1481.3052 1498.0430 1498.3373 1517.0974 1517.4970 1524.9646 1525.8557 1547.7454 1552.2776 1592.2012 1597.9755 1638.8214 1652.7013 2238.5651 3040.2209 3040.6099 3107.5398 3107.7019 3170.1181 3170.1351 3202.1830 3202.5112 3209.3918 3210.9788 3225.4620 3229.9876 3235.9011 3236.2023
redmass: 3.5987 4.6283 5.6989 3.8345 3.7912 3.9633 9.2275 4.6078 4.6658 4.2112 2.3285 1.1855 1.5193 5.0761 3.9640 4.2299 7.4999 3.2935 4.9943 5.1577 4.5301 3.7734 3.7335 3.8716 2.8103 6.5724 5.0030 6.0690 6.7199 6.7176 4.7597 4.8641 5.5660 5.4706 1.2670 1.3315 1.7161 1.5374 6.1139 1.3099 1.3251 1.3085 1.2457 3.1253 2.8426 7.5045 5.5829 4.1974 1.3590 1.4595 1.2686 1.2690 1.2879 1.3716 1.3456 1.2268 3.7765 3.8012 4.1973 2.7657 2.7146 2.5552 2.5321 2.1124 3.1013 3.1726 1.1966 1.2104 1.0452 1.0449 1.0693 1.0728 2.2176 2.1984 5.6833 5.9392 4.9299 5.2887 12.6888 1.0333 1.0332 1.1078 1.1078 1.1022 1.1022 1.0892 1.0893 1.0882 1.0888 1.0944 1.0933 1.0923 1.0923
irintensity: 3.9419 1.8002 4.2879 0.0469 0.2818 11.7644 10.6336 1.8794 1.0184 0.2772 0.5733 0.0040 0.1412 1.0758 2.8180 2.9849 9.6951 1.0019 22.8278 26.5802 0.0025 0.0689 26.8216 50.7579 5.1576 12.6947 27.0079 23.1066 7.5030 4.7258 1.1147 2.9485 5.4559 10.7796 11.5389 9.8179 135.7596 14.5780 0.7322 0.2186 1.4816 1.3586 0.0162 0.0347 2.7903 10.7466 269.0519 0.9232 9.0275 23.7811 1.3404 1.3773 767.8276 42.9220 5.5748 13.6380 4.4788 1017.7725 85.9005 60.7916 403.9718 11.1751 232.7615 2.5551 0.1270 6.8898 21.3710 83.1761 9.7739 9.5218 108.0107 30.3714 122.8610 40.6967 6.2843 30.0994 897.0086 68.8382 150.0782 177.9989 35.8671 44.2388 45.7522 33.8822 29.0299 2.8608 14.1700 17.6955 6.9588 5.2000 11.6964 31.9062 4.8601
temp: 298.150 k
press: 1.00000 atm
elementType: 6 6 6 6 6 1 6 1 6 1 1 6 6 6 6 1 6 1 6 1 6 1 1 1 1 8 8 6 1 1 1 6 7
symmnumber: 1
zpe: 688531.8 jmol-1
zpe.correction: 0.262248 hartree
zpe.thermalcorrener: 0.279193 hartree
zpe.thermalcorrenthalpy: 0.280137 hartree
zpe.thermalcorrgfe: 0.215930 hartree
zpe.sumelectzpe: -823.053070 hartree
zpe.sumelectthermal: -823.036126 hartree
zpe.sumelectthermalent: -823.035181 hartree
zpe.sumelectthermalfe: -823.099388 hartree
dipole: 0.0979 0.0043 -4.2954
dipole: 4.2965
quadrupole: -110.4611 -54.0848 -130.5435
quadrupole: 8.8233 0.4474 0.3157
quadrupole: -12.0980 44.2783 -32.1803 8.8233 0.4474 0.3157
hfenergy: -823.3153184 hartree
pointgroup: C01 [X(C16H14N1O2)]
dipole: 0.0385015 0.0016946 -1.6899525 debye
polarizability: 110.5703874|13.4064974|492.2029258|-3.5827719|0.4063551|268.036179 unknown
InChI: InChI=1/C16H14NO2/c1-18-14-7-3-12(4-8-14)16(11-17)13-5-9-15(19-2)10-6-13/h3-10H,1-2H3
charge 0 multiplicity 2
33 atoms
C  -0.02354518 -0.02037281 1.2104418
C  0.03798802 -1.31393783 0.54590394
C  0.60994714 -1.47005455 -0.7431986
C  -0.4297935 -2.48291761 1.18865793
C  0.67978293 -2.70921625 -1.35318137
H  1.03470166 -0.6106127 -1.24983095
C  -0.36580807 -3.73206111 0.58300298
H  -0.86677861 -2.40686719 2.17998493
C  0.18568708 -3.8550497 -0.70277483
H  1.13071093 -2.82337361 -2.33391537
H  -0.74859376 -4.59645368 1.11216598
C  -0.05438743 1.27375401 0.54489703
C  0.38388457 2.44208508 1.2092386
C  -0.56722294 1.43128319 -0.76866623
C  0.34790319 3.6917861 0.60246292
H  0.77532325 2.36510521 2.21935151
C  -0.60891152 2.67102543 -1.38004269
H  -0.96930956 0.57268159 -1.29479141
C  -0.14462762 3.81622815 -0.706973
H  -1.01499585 2.78603009 -2.38008705
C  -0.17137085 -6.22202075 -0.77886745
H  -1.24612813 -6.16768245 -0.56830332
H  0.37358255 -6.43410548 0.14869409
H  0.70655236 4.55553841 1.14930727
H  0.01834947 -7.01555811 -1.50252097
O  0.29760592 -5.01874166 -1.39095139
O  -0.22492544 4.98040791 -1.39843224
C  0.21550172 6.18338196 -0.76483248
H  0.05819937 6.97744895 -1.49564213
H  1.27973908 6.12937537 -0.50618363
H  -0.37070033 6.39437229 0.13747441
C  -0.05609647 -0.02088222 2.62378861
N  -0.08263606 -0.02140623 3.79475709
