program: Gaussian 09
title: Opt freq
version: EM64L-G09RevD.01
method: UB3LYP
basis: 6-31G(d)
operation: Freq
keyword: #P
keyword: Geom=AllCheck
keyword: Guess=TCheck
keyword: SCRF=Check
keyword: GenChk
keyword: UB3LYP/6-31G(d)
keyword: Freq
converged: YES YES NO YES
polarizability: 9.89272782e+01 8.97735838e+00 5.28030927e+02 -1.19434493e+01 -9.61793032e+00 2.14089655e+02
1716.lowfreq: -9.9658 -3.4751 -2.1658 -0.0008 -0.0001 0.0004 29.4810 37.4037 56.8576
frequency: 29.4477 37.3616 56.8247 73.0407 92.0287 95.1954 136.2534 156.9049 191.4565 202.9250 227.7825 244.9129 272.9321 298.0569 322.4837 350.7392 383.9608 420.2058 425.3690 431.3258 466.9289 489.9645 521.0828 527.8343 541.3728 598.5270 643.9996 649.9851 700.4162 718.4449 743.8573 757.5930 771.9855 808.5736 817.3196 828.2466 837.8722 851.2667 896.0019 940.4860 943.8259 950.8890 965.4843 978.1172 1014.9556 1019.7377 1067.3107 1088.3747 1149.6444 1150.9879 1153.0955 1177.5903 1184.4210 1204.8257 1209.5897 1217.7893 1225.6240 1247.8908 1265.2658 1279.4315 1298.0381 1343.9212 1347.8268 1360.4032 1372.1821 1396.8283 1444.7691 1469.0221 1483.6625 1497.9713 1506.1409 1509.9653 1512.6369 1515.9953 1518.6690 1529.9398 1536.9317 1542.2070 1550.9469 1559.9526 1573.5895 1591.6216 1641.3242 1653.8898 3000.2966 3007.9606 3026.3905 3075.0975 3077.4410 3087.7469 3145.9509 3146.5866 3157.3023 3158.5003 3174.4570 3179.2900 3201.0563 3211.3488 3223.5203 3225.9568 3227.5054 3234.8880
redmass: 3.7624 3.9565 3.3614 3.2657 3.2808 2.7425 2.2513 3.4454 3.0752 2.5144 1.4951 1.7989 1.3076 3.2223 3.3085 4.2298 3.3522 3.5362 3.3002 3.3288 4.0159 3.5917 2.2889 2.4719 3.3260 4.7510 6.9612 6.6754 2.1499 4.1505 4.5460 2.2985 4.4084 1.2727 1.4809 1.8854 2.3246 2.1557 5.0068 1.3096 1.3174 1.2995 3.0029 1.2945 2.7020 2.9057 5.8767 1.5424 1.2707 1.4100 1.3480 1.6564 1.2711 1.7504 1.2358 1.3978 1.5773 1.9328 1.5985 2.7103 3.4738 4.0324 1.6606 2.7690 2.0109 3.2678 2.4070 1.3567 2.0944 1.2426 1.3332 1.0614 1.6060 1.1084 1.0460 1.0921 1.1151 2.0475 1.2151 1.8853 4.6429 5.5072 4.8778 5.0208 1.0486 1.0528 1.0341 1.0913 1.0903 1.1070 1.0860 1.0988 1.0963 1.1007 1.0888 1.0888 1.0887 1.0880 1.0917 1.0909 1.0918 1.0915
irintensity: 2.6780 0.5429 2.1533 2.4874 3.3343 14.6237 4.4952 1.4053 1.1781 0.4533 0.9128 4.3751 1.3330 1.3552 1.3831 2.6806 6.3163 17.0027 5.0885 0.0476 2.4992 3.4003 18.5348 0.7871 51.9006 9.9920 0.1373 2.6486 4.0253 2.4113 1.9528 0.9532 16.6568 2.2391 7.0148 40.7970 79.9217 27.7301 0.1566 0.1275 0.4571 0.2889 60.5266 3.7009 0.8421 0.6933 141.5617 33.7609 7.6672 13.8912 115.4588 3.4316 1.2357 40.2199 180.4874 13.2200 25.1706 32.0394 19.9020 100.6700 581.2113 109.1651 5.7143 13.7695 12.2264 525.4319 51.1925 2.2305 17.4401 95.2753 105.4056 4.6545 2.0623 13.5346 7.1304 105.9916 8.6781 104.5335 116.7051 123.0231 8.4822 4.9182 502.1369 185.1929 98.3588 217.6284 117.0364 40.3066 57.9607 50.7541 21.3288 5.2701 60.3479 36.6332 22.0031 25.8342 23.6887 15.1795 32.4656 31.2617 8.9463 17.9542
temp: 298.150 k
press: 1.00000 atm
elementType: 6 6 6 6 6 1 6 1 6 1 1 6 6 6 6 1 6 1 6 1 6 1 1 7 6 6 1 1 1 1 1 1 1 1 1 8
symmnumber: 1
zpe: 797762.9 jmol-1
zpe.correction: 0.303852 hartree
zpe.thermalcorrener: 0.320877 hartree
zpe.thermalcorrenthalpy: 0.321822 hartree
zpe.thermalcorrgfe: 0.257435 hartree
zpe.sumelectzpe: -750.201712 hartree
zpe.sumelectthermal: -750.184686 hartree
zpe.sumelectthermalent: -750.183742 hartree
zpe.sumelectthermalfe: -750.248129 hartree
dipole: -0.7203 2.2054 -0.0543
dipole: 2.3207
quadrupole: -111.2065 -61.3101 -98.9436
quadrupole: 3.6218 -0.5446 -8.4855
quadrupole: -20.7198 29.1766 -8.4569 3.6218 -0.5446 -8.4855
hfenergy: -750.5055636 hartree
pointgroup: C01 [X(C16H18N1O1)]
dipole: -0.2833877 0.8676902 -0.021347 debye
polarizability: 98.9272782|8.9773584|528.0309269|-11.9434493|-9.6179303|214.0896554 unknown
InChI: InChI=1/C16H18NO/c1-17(2)15-8-4-13(5-9-15)12-14-6-10-16(18-3)11-7-14/h4-12H,1-3H3
charge 0 multiplicity 2
36 atoms
C  -0.12390177 -0.41615245 1.35938139
C  -0.03014712 -1.69116413 0.70783859
C  0.50396866 -1.90274104 -0.59488201
C  -0.44516858 -2.85322113 1.40823828
C  0.57373008 -3.16680363 -1.15501037
H  0.91088037 -1.06571955 -1.150278
C  -0.38176096 -4.126326 0.85256247
H  -0.84124686 -2.74219115 2.41507562
C  0.1217792 -4.2934097 -0.4466348
H  0.9942798 -3.31488575 -2.14538381
H  -0.72354505 -4.97565051 1.4331779
C  -0.07344659 0.90431241 0.81504685
C  0.11280483 2.00885016 1.69160298
C  -0.25341923 1.23858846 -0.55482414
C  0.17091848 3.31672972 1.24689294
H  0.22378077 1.81552195 2.75657712
C  -0.20167559 2.54530375 -1.01115639
H  -0.49257618 0.45850293 -1.26872819
C  0.03920885 3.63097866 -0.13118094
H  -0.37088324 2.72540334 -2.0661765
C  -0.20206508 -6.66394042 -0.42023568
H  -1.2697733 -6.61452001 -0.16942252
H  0.37631656 -6.83504492 0.49712786
N  0.13590961 4.93304621 -0.59136857
C  -0.20708586 5.23092579 -1.97386904
C  0.1541814 6.02969414 0.36528469
H  -1.25747111 4.99790635 -2.20862943
H  0.4296045 4.66604184 -2.66453289
H  -0.75745428 6.06692947 0.98168614
H  1.01659653 5.94983305 1.0373567
H  0.31919056 4.10390967 1.97655565
H  -0.03173741 -7.4893838 -1.11357893
H  0.24303008 6.97411009 -0.17386611
H  -0.03999865 6.29235323 -2.16430317
H  -0.25531051 -0.46338203 2.4400726
O  0.22943109 -5.48908002 -1.09755629
