program: Gaussian 09
title: Opt freq
version: EM64L-G09RevD.01
method: UB3LYP
basis: 6-31G(d)
operation: Freq
keyword: #P
keyword: Geom=AllCheck
keyword: Guess=TCheck
keyword: SCRF=Check
keyword: GenChk
keyword: UB3LYP/6-31G(d)
keyword: Freq
converged: YES YES YES YES
polarizability: 1.01352102e+02 9.24487619e+00 5.44716730e+02 -1.25057670e+01 -1.03690486e+01 2.21914937e+02
1716.lowfreq: -9.9743 -3.2405 -1.9713 -0.0003 0.0003 0.0007 29.4079 37.1699 57.1657
frequency: 29.3731 37.1347 57.1341 73.1588 92.0608 93.9382 135.4048 156.8757 191.2865 202.8208 227.2385 244.5369 272.6924 297.6482 322.0767 350.4482 384.0460 419.9025 425.5178 431.3884 466.8458 489.9605 521.2129 527.8002 541.1946 598.4119 643.7841 649.8077 700.9236 718.4314 743.6554 757.9940 771.7312 808.8011 817.6721 828.1688 837.5524 850.8425 895.6813 941.6915 944.7541 951.1413 964.9784 978.0428 1014.4595 1019.3664 1065.5460 1088.0978 1149.4365 1150.6474 1152.6986 1177.2992 1184.1144 1204.7209 1209.3276 1217.4764 1225.4089 1247.6977 1264.9305 1278.9855 1297.0389 1343.4476 1347.7082 1360.3780 1372.0574 1397.0820 1444.6152 1468.8532 1483.3941 1497.6138 1505.6355 1509.4556 1512.4265 1515.1514 1517.8290 1529.0664 1536.0444 1541.7110 1550.1472 1559.5645 1572.8043 1591.1457 1640.6111 1653.2291 3001.6924 3009.3326 3027.9345 3075.3959 3077.6386 3089.7755 3145.9305 3148.1677 3158.6982 3159.4486 3174.5408 3179.6007 3200.8222 3211.5926 3224.1864 3226.3535 3227.8796 3235.2972
redmass: 3.7607 3.9543 3.3787 3.2494 3.2160 2.7277 2.2852 3.4380 3.0679 2.5231 1.4899 1.8014 1.3061 3.2455 3.3221 4.2345 3.3630 3.5516 3.3012 3.3287 4.0235 3.5965 2.2863 2.4692 3.3335 4.7560 6.9646 6.6720 2.1776 4.1437 4.5774 2.2748 4.3732 1.2728 1.4888 1.8808 2.3147 2.1525 5.0146 1.3087 1.3177 1.2986 3.0120 1.2928 2.7043 2.9131 5.8800 1.5448 1.2769 1.4031 1.3475 1.6603 1.2710 1.7485 1.2362 1.4001 1.5776 1.9359 1.5981 2.7016 3.4534 4.0611 1.6601 2.7662 2.0061 3.2557 2.4059 1.3522 2.0968 1.2408 1.3243 1.0579 1.5845 1.1244 1.0459 1.0908 1.1200 2.0404 1.2085 1.9178 4.6113 5.4897 4.8735 5.0152 1.0483 1.0524 1.0340 1.0919 1.0908 1.1071 1.0859 1.0988 1.0963 1.1009 1.0888 1.0889 1.0888 1.0880 1.0917 1.0909 1.0917 1.0914
irintensity: 2.8671 0.5556 2.4810 2.8567 5.6782 12.9138 4.2498 1.4628 1.2351 0.4925 0.9090 4.6970 1.4260 1.3751 1.4441 2.8167 6.5881 18.5224 5.1461 0.0446 2.6472 3.6018 19.5846 0.8601 55.3940 10.5608 0.1415 2.7810 4.3480 2.5906 1.9951 1.0542 17.6987 2.4200 7.6367 41.2417 86.6401 29.2452 0.1562 0.1253 0.4644 0.2875 62.3476 3.6170 0.9580 0.7896 148.9578 35.5445 9.2286 14.4167 120.0725 3.8712 1.3238 40.9190 193.6287 14.9186 28.8709 32.8791 21.6922 107.3658 608.9547 110.6394 6.2380 14.7038 12.7857 563.5806 52.9637 2.1893 18.9423 100.9371 117.6352 4.3036 2.3637 13.2560 7.4712 106.7719 8.8908 105.9533 130.0301 124.8130 9.1268 5.2107 528.7216 200.4722 103.5803 226.2977 120.0389 42.6621 59.6617 51.8945 24.4808 4.5671 61.1835 36.7018 23.7147 26.9946 25.0412 15.9636 33.0866 31.9904 9.5620 19.0376
temp: 298.150 k
press: 1.00000 atm
elementType: 6 6 6 6 6 1 6 1 6 1 1 6 6 6 6 1 6 1 6 1 6 1 1 7 6 6 1 1 1 1 1 1 1 1 1 8
symmnumber: 1
zpe: 797713.4 jmol-1
zpe.correction: 0.303833 hartree
zpe.thermalcorrener: 0.320866 hartree
zpe.thermalcorrenthalpy: 0.321811 hartree
zpe.thermalcorrgfe: 0.257395 hartree
zpe.sumelectzpe: -750.202645 hartree
zpe.sumelectthermal: -750.185612 hartree
zpe.sumelectthermalent: -750.184668 hartree
zpe.sumelectthermalfe: -750.249083 hartree
dipole: -0.7272 2.3016 -0.0522
dipole: 2.4143
quadrupole: -111.2281 -59.9728 -98.7493
quadrupole: 3.6825 -0.5604 -8.7634
quadrupole: -21.2447 30.0106 -8.7659 3.6825 -0.5604 -8.7634
hfenergy: -750.5064783 hartree
pointgroup: C01 [X(C16H18N1O1)]
dipole: -0.28609 0.9055103 -0.0205301 debye
polarizability: 101.3521016|9.2448762|544.71673|-12.505767|-10.3690486|221.9149365 unknown
InChI: InChI=1/C16H18NO/c1-17(2)15-8-4-13(5-9-15)12-14-6-10-16(18-3)11-7-14/h4-12H,1-3H3
charge 0 multiplicity 2
36 atoms
C  -0.12342677 -0.41632913 1.35578325
C  -0.03037995 -1.69174819 0.70470255
C  0.49849941 -1.90452116 -0.60005922
C  -0.44113561 -2.85366911 1.40832203
C  0.56735458 -3.16942713 -1.15877538
H  0.90193687 -1.06815623 -1.15890314
C  -0.37852416 -4.12750157 0.85416684
H  -0.83298176 -2.74198707 2.41673639
C  0.1198089 -4.29579852 -0.44703772
H  0.98379577 -3.31780289 -2.15087695
H  -0.71677912 -4.97639309 1.43741971
C  -0.07412937 0.90443941 0.81215081
C  0.10903727 2.00853977 1.690417
C  -0.25189092 1.24032058 -0.55786032
C  0.16635293 3.31702228 1.24746798
H  0.21802551 1.81423686 2.75542829
C  -0.20086382 2.54764158 -1.01261998
H  -0.48840924 0.46116981 -1.27363474
C  0.03700471 3.63292597 -0.13082084
H  -0.36807404 2.72876864 -2.0677694
C  -0.20086999 -6.66732528 -0.41543839
H  -1.2674287 -6.6188402 -0.16027485
H  0.38185026 -6.83580858 0.49946575
N  0.13293337 4.9348673 -0.58901515
C  -0.20226978 5.23420553 -1.97343428
C  0.15307456 6.03110128 0.36856431
H  -1.25090563 5.00000021 -2.21404268
H  0.43901009 4.67101668 -2.66122767
H  -0.75797745 6.06794791 0.98556073
H  1.01601774 5.95030235 1.03984175
H  0.31206826 4.10354098 1.97834359
H  -0.03220874 -7.49335086 -1.10838794
H  0.24150261 6.97571259 -0.17007815
H  -0.0358169 6.29607624 -2.1612361
H  -0.25336221 -0.46371383 2.43665283
O  0.22610534 -5.49213809 -1.09667092
