program: Gaussian 09
title: Opt freq
version: EM64L-G09RevD.01
method: UB3LYP
basis: 6-31G(d)
operation: Freq
keyword: #P
keyword: Geom=AllCheck
keyword: Guess=TCheck
keyword: SCRF=Check
keyword: GenChk
keyword: UB3LYP/6-31G(d)
keyword: Freq
converged: YES YES NO YES
polarizability: 1.07114186e+02 9.71408173e+00 5.80653254e+02 -1.37166348e+01 -1.21421973e+01 2.39673519e+02
1716.lowfreq: -9.9942 -2.1672 -0.9604 -0.0007 -0.0005 0.0003 29.4530 36.5544 57.5603
frequency: 29.4179 36.5282 57.5307 73.1991 90.0212 92.9401 133.4476 156.7809 190.7811 202.5039 225.5175 243.6936 272.1668 296.6722 321.1002 349.8035 384.3172 419.2757 425.9179 431.5586 466.7280 489.9746 521.5746 527.6674 540.8469 598.1691 643.3004 649.4417 702.2102 718.4791 743.1960 759.1673 771.1441 809.3122 818.4315 827.8382 836.7793 849.7927 894.9867 944.4034 946.9220 951.6175 963.9389 977.6408 1013.2747 1018.5267 1061.8829 1087.5575 1148.9597 1149.9604 1151.8436 1176.7142 1183.4976 1204.5804 1208.8579 1216.8938 1225.0221 1247.2915 1264.1626 1278.0515 1294.9467 1342.4178 1347.4862 1360.3529 1371.7788 1397.7303 1444.2901 1468.5217 1482.8354 1496.9257 1504.5259 1508.2560 1511.9316 1513.4637 1516.0166 1527.2700 1534.1466 1540.5564 1548.4165 1558.8194 1570.9767 1590.1133 1639.0588 1651.8027 3004.7063 3012.3306 3031.1300 3076.0410 3077.9947 3093.9095 3145.8831 3151.5152 3161.3293 3161.7787 3174.8189 3180.3522 3200.3886 3212.2199 3225.7584 3227.2656 3228.7961 3236.3897
redmass: 3.7624 3.9403 3.3969 3.2019 2.6650 3.1240 2.3663 3.4126 3.0458 2.5290 1.4875 1.8142 1.3029 3.2922 3.3551 4.2456 3.3929 3.5858 3.3033 3.3286 4.0406 3.6080 2.2778 2.4637 3.3520 4.7667 6.9725 6.6623 2.2601 4.1159 4.6529 2.2178 4.2524 1.2729 1.5115 1.8682 2.2820 2.1506 5.0329 1.3066 1.3194 1.2967 3.0149 1.2923 2.7089 2.9302 5.8788 1.5498 1.2961 1.3831 1.3458 1.6697 1.2707 1.7436 1.2380 1.4058 1.5800 1.9421 1.5966 2.6814 3.4065 4.1158 1.6618 2.7505 1.9997 3.2280 2.4052 1.3427 2.1005 1.2355 1.3048 1.0527 1.3728 1.2730 1.0455 1.0883 1.1330 2.0130 1.2072 1.9692 4.5314 5.4479 4.8632 5.0003 1.0474 1.0515 1.0337 1.0932 1.0918 1.1072 1.0859 1.0987 1.1013 1.0963 1.0889 1.0890 1.0889 1.0881 1.0918 1.0909 1.0917 1.0912
irintensity: 3.2484 0.5798 3.4560 3.8015 17.4192 2.0408 3.6088 1.6128 1.3549 0.6089 0.8585 5.4534 1.6664 1.3876 1.6025 3.0799 7.0804 21.8414 5.2852 0.0508 3.0112 4.0419 22.1982 1.0245 63.2897 11.7808 0.1551 3.0493 5.1040 3.0662 2.0756 1.4157 19.9227 2.9246 9.5046 41.0770 104.9190 32.6320 0.1650 0.1139 0.4950 0.2815 65.2547 3.6040 1.2063 1.0389 164.9468 39.6450 14.8014 14.6805 127.2826 4.9601 1.5224 41.8861 224.1084 19.3990 37.4598 33.8918 25.9841 122.5997 667.8600 112.7044 7.6982 17.1325 13.8762 651.8778 56.1293 2.0847 22.1677 114.3230 148.2104 3.0984 5.6556 10.5514 8.1841 107.5212 9.3242 105.5741 159.4858 129.5262 10.5616 5.9045 587.8221 236.0656 115.8164 245.3705 125.8996 49.4966 62.8870 54.8754 30.0611 5.0094 38.8495 60.4340 27.6063 29.7541 28.1856 17.5839 34.3930 32.9458 11.0439 21.4882
temp: 298.150 k
press: 1.00000 atm
elementType: 6 6 6 6 6 1 6 1 6 1 1 6 6 6 6 1 6 1 6 1 6 1 1 7 6 6 1 1 1 1 1 1 1 1 1 8
symmnumber: 1
zpe: 797604.5 jmol-1
zpe.correction: 0.303792 hartree
zpe.thermalcorrener: 0.320845 hartree
zpe.thermalcorrenthalpy: 0.321789 hartree
zpe.thermalcorrgfe: 0.257299 hartree
zpe.sumelectzpe: -750.204687 hartree
zpe.sumelectthermal: -750.187634 hartree
zpe.sumelectthermalent: -750.186690 hartree
zpe.sumelectthermalfe: -750.251179 hartree
dipole: -0.7410 2.5129 -0.0411
dipole: 2.6202
quadrupole: -111.2914 -57.0528 -98.2894
quadrupole: 3.8048 -0.6048 -9.3838
quadrupole: -22.4135 31.8250 -9.4116 3.8048 -0.6048 -9.3838
hfenergy: -750.5084788 hartree
pointgroup: C01[X(C16H18N1O1)]
dipole: -0.2915254 0.9886645 -0.0161889 debye
polarizability: 107.1141865|9.7140817|580.6532541|-13.7166348|-12.1421973|239.6735189 unknown
InChI: InChI=1/C16H18NO/c1-17(2)15-8-4-13(5-9-15)12-14-6-10-16(18-3)11-7-14/h4-12H,1-3H3
charge 0 multiplicity 2
36 atoms
C  -0.12057452 -0.41677121 1.34674315
C  -0.02962108 -1.69327868 0.69690098
C  0.48516874 -1.90921931 -0.61322389
C  -0.42924871 -2.85462418 1.40891769
C  0.55101033 -3.1762238 -1.1684029
H  0.87958058 -1.0745968 -1.18087609
C  -0.36929045 -4.13031018 0.85858754
H  -0.8097098 -2.74112072 2.42145719
C  0.11488165 -4.30177476 -0.44787348
H  0.95622359 -3.3257199 -2.16505492
H  -0.69834954 -4.97799826 1.4486725
C  -0.07477474 0.90472971 0.80485404
C  0.09982723 2.00775313 1.68743334
C  -0.24681695 1.24455686 -0.56550137
C  0.15453179 3.31775622 1.24892441
H  0.203497 1.81101797 2.75254379
C  -0.19789149 2.55339518 -1.01628335
H  -0.47635587 0.46767173 -1.28590943
C  0.03162298 3.63770076 -0.12986777
H  -0.35998419 2.73701498 -2.07176353
C  -0.19962967 -6.67527216 -0.40377302
H  -1.26305973 -6.62792121 -0.13698161
H  0.39405576 -6.83856284 0.50459677
N  0.12548254 4.93956439 -0.58312451
C  -0.18908213 5.24227358 -1.97231537
C  0.14780665 6.0345754 0.37683841
H  -1.23315085 5.00568242 -2.22847284
H  0.46380633 4.68268502 -2.65208141
H  -0.76251587 6.06947109 0.9943873
H  1.0113844 5.95239329 1.04713039
H  0.29293949 4.10265874 1.98292751
H  -0.03665842 -7.50279598 -1.09608519
H  0.23470554 6.97990097 -0.16028441
H  -0.02343964 6.30506844 -2.15393187
H  -0.24650964 -0.46446446 2.42808522
O  0.21708271 -5.49988956 -1.09433398
