program: Gaussian 09
title: Opt freq
version: EM64L-G09RevD.01
method: UB3LYP
basis: 6-31G(d)
operation: Freq
keyword: #P
keyword: Geom=AllCheck
keyword: Guess=TCheck
keyword: SCRF=Check
keyword: GenChk
keyword: UB3LYP/6-31G(d)Freq
converged: YES YES YES YES
polarizability: 1.13008067e+02 4.98480433e+00 6.15857091e+02 -4.13972217e+00 1.09795687e+00 2.50890950e+02
1716.lowfreq: -4.2718 -0.0006 0.0003 0.0005 2.2176 6.7656 28.4314 34.5815 47.7238
frequency: 28.4117 34.4235 47.6324 66.4772 71.9009 89.7246 104.3121 129.2800 143.6068 178.7956 194.5469 216.8310 226.5408 231.9224 263.5549 295.4357 329.3821 353.0839 390.5292 397.9953 425.9920 431.1651 457.6913 482.9597 487.8340 523.8856 526.6130 543.6358 590.8814 646.3207 648.0881 703.8539 720.4902 736.6101 748.7947 759.6348 808.3581 812.4070 821.8203 832.1210 841.5416 895.8891 942.3783 944.4541 948.0129 962.2663 965.2322 974.8357 1014.9879 1017.1874 1087.5187 1088.6592 1148.8379 1150.8232 1152.3820 1154.3923 1162.8031 1182.7223 1204.1722 1206.4126 1222.0895 1229.0788 1256.9555 1272.9667 1276.8984 1282.4305 1353.8172 1357.5476 1368.6708 1374.7237 1388.7426 1395.9123 1446.5819 1468.3854 1474.4609 1489.5749 1504.5956 1508.2818 1508.6526 1510.5308 1513.3568 1514.7915 1516.0153 1536.3784 1537.3761 1545.3710 1551.6663 1553.3643 1562.1214 1574.5940 1574.9377 1643.6323 1656.5573 2996.8515 2998.5217 3004.3742 3006.4264 3072.8851 3073.9543 3077.7543 3078.6748 3141.4839 3144.8776 3145.2777 3155.6932 3157.1651 3171.8549 3172.6897 3207.6223 3217.3773 3224.5772 3226.2858 3228.2235 3234.9084
redmass: 3.6111 3.6260 3.3150 3.1621 2.7586 2.6427 2.9560 2.3619 2.0065 2.3773 2.3905 1.3098 2.1303 1.3410 1.9757 2.4482 3.1598 4.4129 3.2450 3.1731 3.3538 3.3118 3.0468 3.4743 3.5592 2.3816 2.2683 3.0176 4.1351 7.0317 6.5850 2.0239 4.4269 4.7278 4.9761 2.1305 1.2735 1.3907 2.1397 1.8415 2.8431 5.1459 1.3171 1.3060 1.3114 2.1124 3.3038 1.5780 2.6080 2.8524 1.5444 1.5441 1.2368 1.2380 1.3449 1.3588 1.7327 1.6933 1.7607 1.7041 1.2761 1.6821 1.5673 1.6296 2.8296 2.3206 4.2432 1.9920 3.1238 1.7102 3.4493 3.1962 2.0509 1.2906 1.1968 2.1815 1.3662 1.1153 1.1303 1.0691 1.4259 1.1044 1.1677 1.0918 1.1276 1.7561 1.1085 1.2161 2.1547 4.3629 4.8484 4.6157 5.0062 1.0500 1.0484 1.0543 1.0533 1.0904 1.0913 1.0884 1.0891 1.0858 1.0993 1.0988 1.0966 1.0960 1.0887 1.0888 1.0872 1.0860 1.0909 1.0907 1.0924 1.0918
irintensity: 2.2099 0.8756 2.2393 7.8416 4.1468 12.3815 18.2583 13.3091 6.0094 0.1719 0.5319 2.1938 5.1203 1.8432 3.8583 1.3351 0.9236 15.2447 5.6763 28.5396 1.9488 0.1085 3.2653 6.4150 1.1068 9.0691 14.6534 39.1112 0.7294 0.1700 0.1660 7.5284 3.9731 0.5797 2.7374 3.6423 6.9575 1.7134 6.6230 137.2914 5.2433 1.2376 0.1304 0.7064 0.8827 13.3430 133.9010 3.2433 0.1158 0.4253 34.5701 37.3452 2.7992 0.6207 209.1144 71.4348 2.4558 2.2390 5.3632 98.3346 182.2338 0.3550 23.5347 14.7589 107.5280 26.4562 17.0785 8.1034 4.8441 12.7850 1231.9950 62.0574 46.5361 0.9271 18.3939 6.1566 260.1682 13.2887 1.8805 15.9066 2.3306 13.3328 14.7123 6.3441 8.6897 25.6198 10.7134 497.1826 55.9248 15.9072 2.6312 875.1409 65.9133 100.0000 111.4345 303.8166 155.4736 24.7992 87.0724 28.8356 77.7924 27.6771 4.9864 4.8451 65.2495 62.9335 4.2853 53.2518 34.7759 6.8768 40.9824 34.9331 19.4347 24.9291
temp: 298.150 k
press: 1.00000 atm
elementType: 6 6 6 6 6 1 6 1 6 1 1 6 6 6 6 1 6 1 6 1 6 6 1 1 1 1 7 7 6 6 1 1 1 1 1 1 1 1 1 1
symmnumber: 1
zpe: 904721.3 jmol-1
zpe.correction: 0.344590 hartree
zpe.thermalcorrener: 0.363423 hartree
zpe.thermalcorrenthalpy: 0.364367 hartree
zpe.thermalcorrgfe: 0.295703 hartree
zpe.sumelectzpe: -769.610982 hartree
zpe.sumelectthermal: -769.592150 hartree
zpe.sumelectthermalent: -769.591205 hartree
zpe.sumelectthermalfe: -769.659869 hartree
dipole: -0.5924 0.0133 -2.1638
dipole: 2.2434
quadrupole: -119.4900 -59.9207 -102.6434
quadrupole: 0.9654 -0.3017 0.9037
quadrupole: -25.4720 34.0974 -8.6254 0.9654 -0.3017 0.9037
hfenergy: -769.9555722 hartree
pointgroup: C01 [X(C17H21N2)]
dipole: -0.2330579 0.0052218 -0.8512876 debye
polarizability: 113.0080672|4.9848043|615.8570911|-4.1397222|1.0979569|250.8909496 unknown
InChI: InChI=1/C17H21N2/c1-18(2)16-9-5-14(6-10-16)13-15-7-11-17(12-8-15)19(3)4/h5-13H,1-4H3
charge 0 multiplicity 2
40 atoms
C  -0.01704536 -0.00104526 1.47398996
C  0.03720315 -1.30224209 0.8802829
C  0.44024605 -1.58490011 -0.4528237
C  -0.28701881 -2.43950841 1.67026389
C  0.47821323 -2.87491645 -0.95848232
H  0.77246206 -0.77707935 -1.09490848
C  -0.25704593 -3.73104001 1.17517835
H  -0.58940207 -2.2855323 2.70421701
C  0.12603913 -3.99559361 -0.16533598
H  0.80233972 -3.01245672 -1.98341876
H  -0.53551674 -4.54390689 1.83549539
C  -0.01545336 1.29582076 0.86851055
C  0.23301559 2.4392299 1.67668522
C  -0.30311672 1.56940028 -0.49601673
C  0.24858003 3.72695374 1.17090685
H  0.42712771 2.29456095 2.73761771
C  -0.29398811 2.85554934 -1.01294663
H  -0.59328248 0.75874346 -1.1547367
C  0.00920564 3.97977033 -0.20477161
H  -0.54559894 2.98697617 -2.05880219
C  -0.3957578 -6.37600265 0.11086668
C  0.36442446 -5.4871773 -2.09599312
H  -1.47000191 -6.23507548 0.30858399
H  0.11572651 -6.48142044 1.07478166
H  -0.42999079 -5.01612362 -2.69585594
H  1.32668846 -5.07892368 -2.42677654
N  0.17615788 -5.28697239 -0.6669292
N  0.0672816 5.26229266 -0.73011086
C  -0.40785704 5.49695811 -2.08555101
C  0.12300389 6.39939585 0.17696252
H  -1.47602616 5.25755721 -2.20878782
H  0.16035088 4.898383 -2.80649906
H  -0.75359856 6.45464173 0.84161619
H  1.02191518 6.35728745 0.80257044
H  0.44863819 4.54606464 1.85159673
H  -0.266531 -7.312513 -0.4341617
H  0.36951726 -6.55690247 -2.31100404
H  0.17113733 7.32042705 -0.4063866
H  -0.2591203 6.5476457 -2.340481
H  -0.06626662 0.00276638 2.56285121
