program: Gaussian 09
title: Opt freq
version: EM64L-G09RevD.01
method: UB3LYP
basis: 6-31G(d)
operation: Freq
keyword: #P
keyword: Geom=AllCheck
keyword: Guess=TCheck
keyword: SCRF=Check
keyword: GenChk
keyword: UB3LYP/6-31G(d)Freq
converged: YES YES NO YES
polarizability: 1.20373289e+02 6.23918264e+00 6.58776933e+02 -6.83893377e+00 9.79006273e-01 2.70617461e+02
1716.lowfreq: -4.5314 0.0002 0.0007 0.0008 2.7871 5.0254 28.3899 34.2255 47.5127
frequency: 28.3760 34.1632 47.4576 65.3700 72.3204 85.6693 102.4875 127.2655 142.3175 178.3047 194.1373 215.4311 226.2337 230.9791 262.8357 294.3329 328.2311 352.2656 390.4165 397.2726 426.7759 431.7543 457.3909 483.0312 487.9761 523.9068 526.5184 543.3997 590.7221 645.8452 647.6381 704.5001 720.2817 736.1245 748.1446 760.2532 808.9015 812.8955 821.7296 831.4898 840.5979 894.7983 944.2172 946.3101 949.0647 961.7707 964.0740 974.8150 1013.8457 1016.1350 1087.0804 1087.9158 1147.9819 1150.6212 1151.4305 1153.5630 1161.7486 1181.8721 1203.9330 1206.4249 1221.2861 1228.6545 1256.0819 1272.1591 1275.6106 1281.5221 1353.0708 1357.2248 1368.2384 1374.3706 1388.7604 1396.3975 1446.4509 1468.0832 1473.7289 1488.6822 1503.2360 1507.0545 1507.4031 1509.4195 1512.2840 1512.9194 1514.3402 1534.2340 1535.5346 1544.0467 1549.8750 1552.0893 1561.2764 1572.9218 1573.1639 1642.0535 1655.2876 2999.5689 3001.5890 3006.9206 3009.4134 3072.9575 3073.8041 3078.5379 3079.6981 3140.9594 3148.1635 3149.1601 3158.4547 3160.4107 3171.8689 3172.5888 3207.8534 3218.1962 3225.1595 3227.1376 3228.8635 3235.2104
redmass: 3.6219 3.5975 3.3213 3.1086 2.6688 2.6218 2.8296 2.4564 2.0409 2.3883 2.3789 1.3132 2.0440 1.3692 1.9925 2.4745 3.1815 4.4061 3.2760 3.1991 3.3562 3.3105 3.0708 3.4910 3.5683 2.3610 2.2749 3.0361 4.1463 7.0343 6.5846 2.0535 4.4480 4.7378 5.0061 2.0956 1.2746 1.4187 2.1307 1.8408 2.7467 5.1588 1.3175 1.3062 1.3087 2.2584 3.2989 1.5057 2.6123 2.8530 1.5497 1.5503 1.2366 1.2383 1.3422 1.3590 1.7398 1.6990 1.7637 1.7015 1.2761 1.6778 1.5736 1.6283 2.7927 2.3159 4.2934 1.9999 3.1025 1.7030 3.4236 3.1814 2.0468 1.2808 1.1923 2.1890 1.3540 1.0695 1.1822 1.0643 1.1719 1.1933 1.2892 1.0974 1.1416 1.6695 1.1044 1.2677 2.1900 4.3044 4.7594 4.5795 4.9908 1.0494 1.0475 1.0538 1.0524 1.0919 1.0924 1.0896 1.0895 1.0858 1.0992 1.0986 1.0966 1.0960 1.0888 1.0889 1.0874 1.0860 1.0910 1.0907 1.0923 1.0918
irintensity: 2.7561 0.8841 3.6297 13.5404 3.9838 9.3596 22.3615 11.7466 5.5733 0.2255 0.5781 2.7013 5.0856 2.7379 4.5315 1.4723 1.0407 16.9399 6.9185 32.3468 2.3926 0.1337 3.7557 7.2782 1.2719 11.1450 15.7166 45.9231 0.8533 0.1583 0.1707 9.1850 4.4772 0.6773 2.8878 4.2572 8.6063 2.1098 6.9183 158.4815 6.5815 1.6595 0.1036 0.7626 1.0086 13.0423 144.1387 2.2904 0.0902 0.4599 38.3675 41.7805 3.6639 0.6749 221.4390 88.9386 2.6157 2.9896 5.9744 107.4747 224.8147 0.5292 26.1686 20.7807 118.9649 29.8688 21.5882 6.2204 4.8806 13.1378 1419.9419 75.0059 54.1411 1.0730 21.0679 7.8129 319.9685 10.5357 10.6786 15.2809 5.7769 14.8712 13.1073 5.7274 9.1690 12.8391 10.2098 544.9557 63.0832 18.2589 2.6327 999.7794 73.4640 112.2891 126.0315 320.5652 177.7058 31.6881 92.6064 45.8447 70.5187 33.4139 5.5445 5.3289 65.1903 63.8056 4.1936 62.3014 37.4385 5.9666 43.6653 36.8916 22.0753 28.7064
temp: 298.150 k
press: 1.00000 atm
elementType: 6 6 6 6 6 1 6 1 6 1 1 6 6 6 6 1 6 1 6 1 6 6 1 1 1 1 7 7 6 6 1 1 1 1 1 1 1 1 1 1
symmnumber: 1
zpe: 904540.3 jmol-1
zpe.correction: 0.344521 hartree
zpe.thermalcorrener: 0.363385 hartree
zpe.thermalcorrenthalpy: 0.364330 hartree
zpe.thermalcorrgfe: 0.295535 hartree
zpe.sumelectzpe: -769.613218 hartree
zpe.sumelectthermal: -769.594353 hartree
zpe.sumelectthermalent: -769.593409 hartree
zpe.sumelectthermalfe: -769.662204 hartree
dipole: -0.5668 -0.0135 -2.3310
dipole: 2.3989
quadrupole: -119.5060 -55.9119 -102.0968
quadrupole: 1.0000 -0.5653 0.8893
quadrupole: -27.0011 36.5930 -9.5919 1.0000 -0.5653 0.8893
hfenergy: -769.9577388 hartree
pointgroup: C01 [X(C17H21N2)]
dipole: -0.2230123 -0.0052939 -0.9170709 debye
polarizability: 120.3732888|6.2391826|658.7769327|-6.8389338|0.9790063|270.6174611 unknown
InChI: InChI=1/C17H21N2/c1-18(2)16-9-5-14(6-10-16)13-15-7-11-17(12-8-15)19(3)4/h5-13H,1-4H3
charge 0 multiplicity 2
40 atoms
C  -0.042389 0.00055217 1.4690954
C  0.0166016 -1.30160949 0.87742196
C  0.43253213 -1.58800553 -0.45147344
C  -0.31727948 -2.43747486 1.66649736
C  0.47406791 -2.8791992 -0.95421853
H  0.77104481 -0.78254624 -1.09326884
C  -0.28410535 -3.73020595 1.17457593
H  -0.62959317 -2.28128404 2.6971888
C  0.11233213 -3.99848993 -0.1621343
H  0.80778192 -3.01915696 -1.97572609
H  -0.57024923 -4.54131162 1.83375743
C  -0.03004639 1.29764159 0.86376941
C  0.20408111 2.44100384 1.67731393
C  -0.29285667 1.57292003 -0.50590796
C  0.22884607 3.72928085 1.17307055
H  0.3785386 2.29587429 2.74161989
C  -0.27435541 2.85956149 -1.02169324
H  -0.57037223 0.76348295 -1.17153603
C  0.0145282 3.98379684 -0.20717937
H  -0.50673439 2.99168506 -2.07186527
C  -0.40195104 -6.38032958 0.11945103
C  0.38098681 -5.49592234 -2.08485025
H  -1.47691077 -6.2435793 0.31427681
H  0.10784865 -6.48122474 1.08478101
H  -0.39977176 -5.02313246 -2.70039734
H  1.35119332 -5.09314443 -2.39890223
N  0.16551648 -5.28923215 -0.6598825
N  0.08254994 5.26528613 -0.72989095
C  -0.36341258 5.50192313 -2.09567832
C  0.12957337 6.40293565 0.17816875
H  -1.42868649 5.26328342 -2.24070365
H  0.21917208 4.90356036 -2.80514022
H  -0.75610422 6.46005987 0.83002
H  1.01939252 6.35817175 0.81637111
H  0.41621592 4.54776231 1.85809861
H  -0.26766279 -7.31676363 -0.42395695
H  0.38413631 -6.56620325 -2.29567249
H  0.18783556 7.32341979 -0.40467312
H  -0.20898237 6.55271052 -2.34575654
H  -0.10665682 0.00499615 2.55722688
