program: Gaussian 09
title: Opt freq
version: EM64L-G09RevD.01
method: RB3LYP
basis: 6-31G(d)
operation: Freq
keyword: #P
keyword: Geom=AllCheck
keyword: Guess=TCheck
keyword: SCRF=Check
keyword: GenChk
keyword: RB3LYP/6-31G(d)Freq
converged: YES YES NO YES
title: Mulliken charges:
elementType: C C C C C H C H C H H C C C C H C H C H C C H H H H N N C C H H H H H H H H H H
charge: -0.261224 0.176619 -0.180325 -0.177231 -0.189125 0.170642 -0.189469 0.171470 0.392300 0.170484 0.170765 0.176616 -0.177230 -0.180333 -0.189469 0.171466 -0.189121 0.170644 0.392300 0.170480 -0.333116 -0.333113 0.191667 0.191404 0.191999 0.190941 -0.458587 -0.458585 -0.333113 -0.333114 0.191028 0.190942 0.191580 0.191400 0.170766 0.191578 0.191029 0.191663 0.192002 0.181370
chargesum: 1.00000
title: Mulliken charges with hydrogens summed into heavy atoms:
elementType: C C C C C C C C C C C C C C C N N C C
charge: -0.079854 0.176619 -0.009683 -0.005761 -0.018641 -0.018704 0.392300 0.176616 -0.005764 -0.009689 -0.018703 -0.018641 0.392300 0.241532 0.240858 -0.458587 -0.458585 0.240859 0.241530
polarizability: 1.03570368e+02 1.79529244e+00 8.55254657e+02 -1.07582610e-01 2.95153954e-01 2.32666712e+02
1716.lowfreq: -16.4235 -0.0010 -0.0008 -0.0004 5.3006 6.4309 32.4533 33.6506 53.7871
frequency: 32.2963 33.6180 53.7416 76.8438 82.6994 117.6353 122.5052 135.9071 143.2351 185.1158 198.2451 204.1825 206.3180 236.3004 283.4087 284.9616 323.2131 341.6946 390.6637 396.9358 438.6221 455.3015 464.3597 493.0107 496.6587 530.9188 534.5084 544.5147 592.0118 636.3800 640.2263 732.7172 734.8538 742.8255 756.4104 804.2418 808.6200 826.1791 841.6316 851.2404 891.3713 948.3947 959.1276 959.9217 977.6605 978.0793 996.0012 1001.2386 1007.7351 1009.4476 1084.9327 1084.9744 1140.1736 1140.2534 1153.6054 1153.7440 1169.7495 1191.2990 1210.0790 1210.7911 1226.0212 1255.1395 1273.0834 1275.2682 1275.8985 1310.2345 1376.8826 1381.0022 1396.2616 1404.5380 1419.4138 1443.7941 1470.9864 1471.6042 1490.7423 1502.8205 1512.6106 1512.9215 1513.5562 1518.8010 1521.8209 1522.0949 1526.3346 1536.8939 1545.2613 1550.3920 1555.2913 1561.8384 1563.6153 1592.5322 1612.1490 1652.5604 1687.4514 3049.0504 3049.0635 3053.8591 3054.9832 3111.1048 3111.1447 3112.4169 3112.4324 3153.9586 3177.4576 3177.5899 3189.8516 3189.8927 3197.8139 3198.5405 3228.1770 3240.6710 3249.2871 3249.4052 3251.0964 3255.7389
redmass: 3.7736 3.8249 3.5458 3.0376 2.2571 2.4721 2.9758 1.3689 1.4572 2.7147 3.5099 1.2719 1.2633 2.9691 3.5212 2.5167 3.6113 3.4433 3.5925 3.1476 3.2381 3.3939 3.3020 3.6457 3.6423 2.5915 2.3778 2.6146 4.4077 7.0611 6.5332 4.2431 4.6008 3.6269 4.9690 1.2991 1.2659 4.1466 1.7922 2.1093 5.3075 1.4018 3.1622 3.1216 1.3275 1.3190 1.4198 1.2749 2.7876 3.0038 1.6403 1.6414 1.2307 1.2308 1.3369 1.3363 1.8416 1.7686 1.6116 1.6302 1.2520 1.2468 1.4970 2.0500 2.1666 2.2122 1.5469 1.6951 5.0908 2.4053 2.3719 2.5305 1.1781 1.1532 1.5172 1.2233 1.1528 1.0401 1.4719 1.4613 1.0493 1.0551 1.2004 1.8435 1.2901 1.1966 1.9615 3.1978 4.1371 2.8075 3.9307 4.8781 5.5270 1.0364 1.0364 1.0393 1.0394 1.1051 1.1051 1.1065 1.1065 1.0879 1.1009 1.1008 1.0981 1.0981 1.0904 1.0905 1.0891 1.0868 1.0920 1.0920 1.0932 1.0935
irintensity: 0.1158 1.8817 0.3423 0.0231 0.2526 0.0886 8.1304 0.3416 2.9070 0.2967 0.5027 1.2994 0.1318 0.0224 0.0830 27.1613 6.5573 0.4405 10.8520 69.9220 0.4250 111.4211 0.4754 7.7872 3.1863 168.7998 1.4171 32.1098 0.0576 0.8047 1.0013 0.0908 235.0135 3.2762 0.0338 40.0744 0.0151 0.1653 179.6525 10.8130 113.7047 246.1323 2.6321 74.1542 43.0290 0.1268 91.9230 0.0721 2.3829 2.9650 13.4463 53.4676 5.0135 1.9409 22.5092 1.7281 42.5595 1.9889 356.5444 1.9623 2492.8786 8.5626 0.5649 8.5340 37.9952 1.2889 23.3108 74.4085 0.9470 1004.4032 3446.4198 50.2101 35.7948 0.2267 835.5942 17.1196 34.7181 0.6384 17.8042 0.5658 37.7408 3.7839 179.2445 13.7954 63.5295 6.2839 1397.0287 492.7210 17.7699 60.3686 809.6839 1774.7026 95.6541 17.9917 82.4544 357.8803 9.8870 6.0581 7.5702 15.2808 54.6118 8.6782 1.4849 1.5219 62.8110 8.1094 3.4960 16.0683 1.9505 0.1334 22.7544 4.2298 18.2232 6.8562
temp: 298.150 k
press: 1.00000 atm
elementType: 6 6 6 6 6 1 6 1 6 1 1 6 6 6 6 1 6 1 6 1 6 6 1 1 1 1 7 7 6 6 1 1 1 1 1 1 1 1 1 1
symmnumber: 1
zpe: 914644.9 jmol-1
zpe.correction: 0.348370 hartree
zpe.thermalcorrener: 0.366920 hartree
zpe.thermalcorrenthalpy: 0.367864 hartree
zpe.thermalcorrgfe: 0.300938 hartree
zpe.sumelectzpe: -769.472196 hartree
zpe.sumelectthermal: -769.453646 hartree
zpe.sumelectthermalent: -769.452702 hartree
zpe.sumelectthermalfe: -769.519629 hartree
dipole: -0.1249 0.0088 -1.5464
dipole: 1.5514
quadrupole: -114.3807 21.3748 -88.1266
quadrupole: 1.1030 0.0192 0.0504
quadrupole: -54.0032 81.7523 -27.7491 1.1030 0.0192 0.0504
hfenergy: -769.8205661 hartree
pointgroup: C01 [X(C17H21N2)]
dipole: 0.0003248 0.0002225 -0.5030157 debye
polarizability: 103.5703676|1.7952924|855.2546571|-0.1075826|0.295154|232.6667125 unknown
InChI: InChI=1/C17H21N2/c1-18(2)16-9-5-14(6-10-16)13-15-7-11-17(12-8-15)19(3)4/h5-13H,1-4H3
charge 1 multiplicity 1
40 atoms
C  -0.02739915 0.0010262 1.39526094
C  0.01117367 -1.28536212 0.81857858
C  0.33386247 -1.57377813 -0.54247465
C  -0.24589032 -2.41033384 1.66115659
C  0.33993739 -2.85539682 -1.02979988
H  0.64512015 -0.77359287 -1.20262785
C  -0.26416988 -3.69634407 1.18561994
H  -0.46260804 -2.23681361 2.71189052
C  0.01316531 -3.96972553 -0.19080363
H  0.62625945 -3.01763983 -2.06068652
H  -0.48838787 -4.50475394 1.86895845
C  -0.06495114 1.28794849 0.81970668
C  0.19073845 2.41212951 1.66376121
C  -0.38523019 1.57765745 -0.54164591
C  0.20987296 3.69858914 1.18947403
H  0.40570624 2.23763026 2.71469383
C  -0.39047127 2.8597431 -1.02775625
H  -0.69528095 0.77811593 -1.20314501
C  -0.06522572 3.97328747 -0.18714129
H  -0.67491106 3.02294158 -2.05901437
C  -0.28868446 -6.36445285 0.20814729
C  0.27850594 -5.49262133 -2.08927335
H  -1.28668726 -6.27689646 0.6516992
H  0.45264144 -6.43113931 1.01236737
H  0.15756896 -6.55679451 -2.28581755
H  -0.4136562 -4.94310287 -2.73610183
N  -0.00647816 -5.23141387 -0.67634694
N  -0.04484451 5.23544124 -0.67143308
C  -0.32757529 5.49806132 -2.0845515
C  0.23561053 6.36762288 0.21471784
H  -1.35451262 5.21441727 -2.34252962
H  0.36570474 4.94931351 -2.73082803
H  0.19754989 7.28970532 -0.36305439
H  -0.50690586 6.4330972 1.01794118
H  0.43311613 4.50630797 1.87394756
H  -0.25019711 -7.28591132 -0.370607
H  1.30589996 -5.20884124 -2.34527129
H  1.2330225 6.28001164 0.65960277
H  -0.20640617 6.56244922 -2.27981081
H  -0.02832768 0.00051031 2.48539403
