charge: -2
program: ADF
programVersion: 2019
title: Hydrogen (TZP)
runtype: SINGLE POINT
method: DFT
functional: Becke88 Perdew86
basis: TZP
formula: H3NbO5
InChI: InChI=1/Nb.3H2O.2O/h;3*1H2;;/q+3;;;;;/p-3/rH3NbO5/c2-1(3,4,5)6/h2-4H
9 atoms
Nb 1.6516 1.3630 2.9983
H  3.2286 0.2416 1.3831
H  3.9239 2.3905 3.5231
O  2.0285 2.9118 4.3656
O  3.7675 1.6394 2.9181
O  0.9223 0.1141 4.1052
H  1.1793 3.3551 4.5547
O  2.2613 0.1243 1.4408
O  0.3078 2.2165 2.1092
functional: VWN
spinMolecule: Restricted
epsl: 78.39000
energy: -7.430 -7.341 -6.788 -6.461 -6.251 -6.032 -5.758 -5.632 -5.428 -5.265 -0.739 -0.396 -0.214 0.842 0.981 1.250 1.422 1.543 2.548 3.284 electronvolt
elementType: Nb H H O O O H O O
charge: 1.9073 0.2904 0.2905 -0.9294 -0.9535 -0.9870 0.2830 -0.9153 -0.9859
mdcq: 2.017978 0.314969 0.378095 -1.089512 -0.991152 -1.036578 0.407644 -0.962053 -1.039391
dipole: -14.80097711 -10.76287154 -27.89436291
dipole: 33.36171173
quadrupole: 16.73079843 -20.10193925 -50.96399899 31.49184518 -32.52555625 -48.22264362
eener: -30.4054 electronvolt
kinener: 59.2650 electronvolt
coulombener: -26.9856 electronvolt
xcener: -58.8935 electronvolt
solvener: -9.2874 electronvolt
total: -66.3069 electronvolt
mo.energy: -22.833 electronvolt
energy: -24.141 -24.141 -24.141 -6.626 -6.626 -6.626 -4.182 electronvolt
mo.energy: -22.460 electronvolt
energy: -24.141 -24.141 -6.626 -6.626 -9.204 -9.204 electronvolt
mo.energy: -22.291 electronvolt
energy: -24.141 -24.141 -6.626 -24.141 -9.204 -9.204 -6.626 electronvolt
mo.energy: -20.295 electronvolt
energy: -24.141 -24.141 -3.169 -34.742 electronvolt
mo.energy: -20.088 electronvolt
energy: -24.141 -24.141 -3.169 -3.169 -34.742 -34.742 electronvolt
mo.energy: -10.817 electronvolt
energy: -9.204 -9.204 -9.204 -9.204 -9.204 -6.626 -6.626 -6.626 -9.204 -24.141 -24.141 -3.169 -3.169 -3.169 -24.141 -3.169 2.536 electronvolt
mo.energy: -9.875 electronvolt
energy: -9.204 -9.204 -9.204 -6.626 -6.626 -24.141 -24.141 -9.204 -9.204 2.536 2.536 electronvolt
mo.energy: -9.405 electronvolt
energy: -9.204 -9.204 -9.204 -6.626 -9.204 -9.204 -9.204 -24.141 -3.169 -4.182 -6.626 -6.626 -9.204 2.536 -9.204 -9.204 electronvolt
mo.energy: -7.560 electronvolt
energy: -9.204 -9.204 -9.204 -3.169 -9.204 -9.204 -9.204 -9.204 -3.169 -3.169 -9.204 -9.204 -9.204 -9.204 2.764 -24.141 2.764 electronvolt
mo.energy: -7.459 electronvolt
energy: -9.204 -3.169 -9.204 -9.204 -9.204 -9.204 -3.169 -9.204 -9.204 -9.204 -9.204 -3.169 -9.204 -9.204 -9.204 -9.204 -0.867 -3.169 -3.169 electronvolt
mo.energy: -7.430 electronvolt
energy: -3.169 -9.204 -9.204 -9.204 -9.204 -9.204 -9.204 -9.204 -9.204 -9.204 -3.169 -3.169 -9.204 electronvolt
mo.energy: -7.341 electronvolt
energy: -9.204 -3.169 -9.204 -9.204 -9.204 -3.169 -9.204 -9.204 -9.204 -9.204 -3.169 -9.204 -0.867 -9.204 electronvolt
mo.energy: -6.788 electronvolt
energy: -9.204 -9.204 -9.204 -9.204 -9.204 -9.204 -9.204 -9.204 -9.204 -9.204 -9.204 -24.141 -9.204 -3.169 electronvolt
mo.energy: -6.461 electronvolt
energy: -9.204 -9.204 -9.204 -9.204 -9.204 -3.169 -3.169 -9.204 -9.204 electronvolt
mo.energy: -6.251 electronvolt
energy: -9.204 -9.204 -9.204 -9.204 -9.204 -9.204 -9.204 -9.204 -9.204 -9.204 -9.204 -3.169 -9.204 -0.867 electronvolt
mo.energy: -6.032 electronvolt
energy: -9.204 -9.204 -9.204 -9.204 -9.204 -9.204 -3.169 -3.169 -9.204 -9.204 -9.204 -9.204 -0.867 electronvolt
mo.energy: -5.758 electronvolt
energy: -9.204 -9.204 -9.204 -9.204 -9.204 -9.204 -9.204 -9.204 -9.204 -9.204 electronvolt
mo.energy: -5.632 electronvolt
mo.energy: -5.428 electronvolt
energy: -9.204 -9.204 -9.204 -9.204 -9.204 -9.204 -9.204 -9.204 electronvolt
mo.energy: -5.265 electronvolt
energy: -9.204 -9.204 -9.204 -9.204 -9.204 -9.204 -9.204 electronvolt
mo.energy: -0.739 electronvolt
energy: -3.169 -3.169 -9.204 -9.204 -6.626 -9.204 2.536 -9.204 -6.626 2.764 -3.169 electronvolt
mo.energy: -0.396 electronvolt
energy: 0.753 -4.182 2.536 -6.626 2.536 -6.626 -3.169 2.536 -6.626 -3.169 electronvolt
mo.energy: -0.214 electronvolt
energy: -3.169 -3.169 -9.204 2.764 -9.204 -9.204 -9.204 -9.204 -9.204 2.764 electronvolt
mo.energy: 0.842 electronvolt
energy: -3.169 -6.626 2.536 -3.169 -9.204 -3.169 -9.204 -0.867 2.764 -3.169 -9.204 -4.182 -3.169 2.764 2.764 0.753 2.764 -24.141 electronvolt
mo.energy: 0.981 electronvolt
energy: -6.626 2.536 2.536 -6.626 -0.867 -0.867 -9.204 -0.867 9.644 9.644 10.872 -9.204 10.872 electronvolt
mo.energy: 1.250 electronvolt
energy: -3.169 -3.169 -3.169 -6.626 -6.626 -0.867 2.536 -4.182 -0.867 -9.204 -9.204 -0.867 0.753 -6.626 -9.204 2.536 -9.204 -9.204 -9.204 9.644 9.644 electronvolt
mo.energy: 1.422 electronvolt
energy: 2.536 -6.626 -3.169 -9.204 -3.169 -9.204 0.753 -4.182 -0.867 9.644 9.644 -9.204 -9.204 -0.867 -9.204 9.644 -9.204 electronvolt
mo.energy: 1.543 electronvolt
energy: -3.169 -6.626 -3.169 -3.169 -6.626 0.753 -0.867 -3.169 -3.169 2.536 -9.204 -0.867 2.536 -9.204 -9.204 -9.204 -9.204 -9.204 -9.204 9.644 24.443 -9.204 electronvolt
mo.energy: 2.548 electronvolt
energy: -3.169 2.764 -6.626 -6.626 2.536 -6.626 9.644 2.764 -3.169 2.536 9.644 9.644 -0.867 -9.204 -3.169 -9.204 -3.169 2.764 2.536 -9.204 9.644 9.644 0.753 9.644 -9.204 -9.204 2.764 41.229 -9.204 electronvolt
mo.energy: 3.284 electronvolt
energy: 2.764 2.764 2.764 2.764 -3.169 9.644 -6.626 2.764 9.644 9.644 -3.169 -0.867 9.644 9.644 9.644 -9.204 electronvolt
mo.energy: 3.513 electronvolt
energy: 2.764 2.764 -3.169 2.764 2.764 -0.867 9.644 9.644 9.644 9.644 -9.204 9.644 9.644 -3.169 -9.204 -3.169 -9.204 10.872 electronvolt
mo.energy: 3.653 electronvolt
energy: 2.764 2.764 -4.182 -0.867 0.753 2.764 24.443 2.764 -3.169 -0.867 9.644 9.782 -9.204 9.644 -3.169 9.644 -9.204 -3.169 9.644 9.644 electronvolt
mo.energy: 3.784 electronvolt
energy: -0.867 0.753 -0.867 -4.182 24.443 2.764 2.764 -3.169 9.782 2.764 9.644 -24.141 -3.169 -0.867 9.644 9.644 -3.169 -9.204 -6.626 electronvolt
mo.energy: 3.918 electronvolt
energy: 2.764 -4.182 0.753 2.764 -0.867 9.782 -0.867 2.764 -3.169 24.443 9.644 9.644 -0.867 2.536 -9.204 -9.204 9.644 9.644 2.764 -3.169 -6.626 9.644 9.644 -24.141 -9.204 24.443 9.644 electronvolt
mo.energy: 4.075 electronvolt
energy: 2.764 2.764 2.764 9.644 -9.204 9.644 -9.204 0.753 9.644 -9.204 2.764 9.644 -9.204 2.536 electronvolt
charge: 0
title: Niobium (TZP, 3d frozen)
title: Oxygen (TZP, 1s frozen)
title: *** (NO TITLE) ***
