charge: 0
program: ADF
programVersion: 2019
title: Hydrogen (TZP)
runtype: SINGLE POINT
method: DFT
functional: Becke88 Perdew86
basis: TZP
formula: H2O7W2
InChI: InChI=1/2H2O.5O.2W/h2*1H2;;;;;;;/q;;;;;;;2*+1/p-2/rH2O7W2/c1-8(2,3)7-9(4,5)6/h1,4H
11 atoms
W  -0.5352 5.8060 2.3812
W  -1.0654 3.0390 4.7883
O  0.3623 2.3653 5.8213
O  -1.4386 5.1308 1.0706
O  -0.6406 4.6603 3.8932
O  -1.1099 7.5655 2.7465
O  -2.3699 3.3338 5.8897
O  1.1180 5.9206 1.8754
O  -1.5991 1.8574 3.6441
H  0.9386 1.6850 5.4111
H  -2.0396 7.7933 2.5306
functional: VWN
spinMolecule: Restricted
epsl: 78.39000
energy: -9.553 -9.165 -8.978 -8.871 -8.595 -8.535 -8.327 -8.150 -7.682 -7.677 -3.293 -3.227 -2.526 -2.370 -2.158 -1.260 -1.135 -0.757 -0.723 -0.319 electronvolt
elementType: W W O O O O O O O H H
charge: 2.4545 2.4537 -0.7596 -0.7633 -1.0252 -0.7600 -0.7666 -0.7672 -0.7637 0.3487 0.3486
mdcq: 2.553059 0.913854 -0.469700 -0.821301 -0.596697 -0.805914 -0.402031 -0.819628 -0.399206 0.450331 0.397235
dipole: 1.13078281 1.52516678 1.86094243
dipole: 2.65855415
quadrupole: -10.73318916 -18.58239747 14.88499575 18.61972220 12.57359336 -7.88653304
eener: -65.3942 electronvolt
kinener: 73.5737 electronvolt
coulombener: -24.4384 electronvolt
xcener: -64.3491 electronvolt
solvener: -1.2648 electronvolt
total: -81.8728 electronvolt
mo.energy: -25.512 electronvolt
energy: -24.141 -24.141 -6.626 -6.626 -24.141 electronvolt
mo.energy: -25.484 electronvolt
energy: -24.141 -24.141 -6.626 -6.626 electronvolt
mo.energy: -24.739 electronvolt
energy: -24.141 -24.141 -24.141 -4.634 electronvolt
mo.energy: -23.397 electronvolt
energy: -24.141 -24.141 -24.141 -24.141 -4.634 electronvolt
mo.energy: -23.363 electronvolt
energy: -24.141 -24.141 -24.141 -24.141 -4.634 -24.141 electronvolt
mo.energy: -23.100 electronvolt
energy: -24.141 -24.141 -24.141 -24.141 -4.634 -4.634 -43.331 -4.634 electronvolt
energy: -24.141 -24.141 -24.141 -24.141 -4.634 -4.634 -43.331 electronvolt
mo.energy: -13.430 electronvolt
energy: -9.204 -9.204 -9.204 -9.204 -6.626 -6.626 -4.634 -4.634 2.536 -24.141 2.536 -24.141 -4.634 electronvolt
mo.energy: -13.418 electronvolt
energy: -9.204 -9.204 -9.204 -9.204 -6.626 -6.626 -4.634 -4.634 -24.141 2.536 -24.141 2.536 -4.634 electronvolt
mo.energy: -12.767 electronvolt
energy: -9.204 -9.204 -4.634 -4.634 -4.634 -4.634 -4.634 -9.204 -4.634 3.974 electronvolt
mo.energy: -11.048 electronvolt
energy: -9.204 -9.204 -9.204 -4.634 -4.634 -4.634 -9.204 -9.204 -9.204 -4.634 -9.204 -9.204 -4.634 -9.204 -4.634 -4.634 -9.204 -9.204 electronvolt
mo.energy: -11.014 electronvolt
energy: -9.204 -4.634 -4.634 -4.634 -9.204 -9.204 -4.634 -9.204 -9.204 -9.204 -9.204 -9.204 -9.204 -4.634 -9.204 -9.204 -9.204 -9.204 -4.634 -4.634 electronvolt
mo.energy: -10.632 electronvolt
energy: -9.204 -4.634 -9.204 -4.634 -9.204 -9.204 -9.204 -9.204 -4.634 -9.204 -9.204 -4.634 -9.204 -9.204 -4.634 electronvolt
mo.energy: -10.625 electronvolt
energy: -9.204 -9.204 -9.204 -4.634 -4.634 -9.204 -9.204 -4.634 -4.634 -9.204 -9.204 -9.204 -9.204 -4.634 -9.204 -9.204 -9.204 -9.204 electronvolt
mo.energy: -10.262 electronvolt
energy: -9.204 -9.204 -9.204 -4.634 -9.204 -9.204 -9.204 -4.634 -4.634 -9.204 -4.634 -9.204 -9.204 -9.204 -4.634 -9.204 -9.204 -9.204 electronvolt
mo.energy: -10.252 electronvolt
energy: -9.204 -9.204 -9.204 -4.634 -9.204 -9.204 -4.634 -4.634 -9.204 -9.204 -4.634 -4.634 -4.634 -9.204 -9.204 -24.141 -24.141 electronvolt
mo.energy: -9.967 electronvolt
energy: -9.204 -9.204 -4.634 -4.634 -9.204 -9.204 -9.204 -9.204 -9.204 -4.634 -4.634 -4.634 -4.634 -9.204 -9.204 -24.141 -9.204 -4.634 electronvolt
mo.energy: -9.948 electronvolt
energy: -9.204 -9.204 -9.204 -4.634 -9.204 -9.204 -9.204 -9.204 -9.204 -9.204 -9.204 -9.204 -9.204 -9.204 -4.634 -4.634 -9.204 -9.204 -9.204 -4.634 -9.204 -24.141 -24.141 -9.204 -4.634 electronvolt
mo.energy: -9.553 electronvolt
energy: -9.204 -9.204 -9.204 -9.204 -9.204 -9.204 -4.634 -4.634 -9.204 -9.204 -9.204 -9.204 -9.204 -4.634 -9.204 -9.204 -4.634 electronvolt
mo.energy: -9.165 electronvolt
energy: -9.204 -9.204 -9.204 -9.204 -9.204 -9.204 -9.204 -9.204 -9.204 -9.204 -9.204 -9.204 -4.634 -4.634 -9.204 -4.634 -9.204 -4.634 -9.204 -24.141 -24.141 electronvolt
mo.energy: -8.978 electronvolt
energy: -9.204 -9.204 -9.204 -9.204 -9.204 -9.204 -9.204 -9.204 -9.204 -9.204 -9.204 -9.204 -9.204 -4.634 -9.204 -4.634 -9.204 electronvolt
mo.energy: -8.871 electronvolt
energy: -9.204 -9.204 -9.204 -9.204 -9.204 -9.204 -9.204 -9.204 -9.204 -4.634 electronvolt
mo.energy: -8.595 electronvolt
energy: -9.204 -9.204 -9.204 -9.204 -9.204 -9.204 -9.204 -9.204 -9.204 -9.204 -9.204 -9.204 -9.204 -9.204 -9.204 -9.204 electronvolt
mo.energy: -8.535 electronvolt
energy: -9.204 -9.204 -9.204 -9.204 -9.204 -9.204 -9.204 -9.204 -9.204 -9.204 -9.204 -9.204 -9.204 -9.204 -9.204 -4.634 -9.204 electronvolt
mo.energy: -8.327 electronvolt
energy: -9.204 -9.204 -9.204 -9.204 -9.204 -9.204 -9.204 -9.204 -9.204 -9.204 -9.204 -9.204 -9.204 -9.204 electronvolt
mo.energy: -8.150 electronvolt
energy: -9.204 -9.204 -9.204 -9.204 -9.204 -9.204 -9.204 -9.204 -9.204 -9.204 -9.204 -9.204 -9.204 -9.204 -9.204 -9.204 -9.204 electronvolt
mo.energy: -7.682 electronvolt
energy: -9.204 -9.204 -9.204 -9.204 -9.204 -9.204 -9.204 -9.204 -9.204 -9.204 electronvolt
mo.energy: -7.677 electronvolt
mo.energy: -3.293 electronvolt
energy: -4.634 -4.634 -4.634 -4.634 -4.634 -9.204 -9.204 -9.204 -9.204 -4.634 -9.204 -9.204 -9.204 -9.204 -9.204 -9.204 -4.634 -9.204 -0.650 electronvolt
mo.energy: -3.227 electronvolt
energy: -4.634 -4.634 -4.634 -4.634 -4.634 -9.204 -9.204 -9.204 -9.204 -4.634 -9.204 3.974 -9.204 -9.204 -4.634 3.974 -9.204 -9.204 electronvolt
mo.energy: -2.526 electronvolt
energy: -4.634 -4.634 -4.634 -9.204 -9.204 -4.634 -4.634 -9.204 -9.204 -4.634 -9.204 -9.204 -4.634 -9.204 -9.204 3.974 -9.204 3.974 -4.634 electronvolt
mo.energy: -2.370 electronvolt
energy: -4.634 -4.634 -4.634 -4.634 -4.634 -9.204 -9.204 -9.204 -4.634 -9.204 -9.204 -9.204 -9.204 -4.634 -9.204 -9.204 -4.634 -9.204 -4.634 3.974 -9.204 3.974 electronvolt
mo.energy: -2.158 electronvolt
energy: -4.634 -4.634 -4.634 -4.634 -4.634 -9.204 -9.204 -4.634 -9.204 -4.634 -24.141 -4.634 -9.204 -9.204 -9.204 -9.204 -9.204 -5.837 -5.837 electronvolt
mo.energy: -1.260 electronvolt
energy: -5.837 -5.837 1.300 1.300 -4.634 -4.634 -6.626 -6.626 -4.634 2.536 2.536 -4.634 -9.204 24.443 -9.204 -9.204 24.443 24.443 -9.204 -24.141 -24.141 electronvolt
mo.energy: -1.135 electronvolt
energy: -4.634 -4.634 -4.634 -4.634 -4.634 -9.204 -4.634 -9.204 -4.634 -9.204 -5.837 -9.204 -9.204 -9.204 -9.204 -5.837 -4.634 -9.204 -9.204 -4.634 -4.634 -9.204 -0.650 electronvolt
mo.energy: -0.757 electronvolt
energy: -4.634 -4.634 -5.837 -5.837 -9.204 -4.634 1.300 -9.204 -9.204 -0.650 -0.650 1.300 -0.650 -9.204 -9.204 -9.204 -9.204 -4.634 -4.634 -9.204 -0.650 -9.204 electronvolt
mo.energy: -0.723 electronvolt
energy: -4.634 -4.634 -4.634 -0.650 -9.204 -4.634 -9.204 -9.204 -9.204 -9.204 -9.204 -4.634 -0.650 -4.634 -9.204 -4.634 -9.204 -0.650 -9.204 -9.204 -6.626 -0.650 electronvolt
mo.energy: -0.319 electronvolt
energy: -4.634 -4.634 -4.634 -4.634 -9.204 -9.204 -6.626 -4.634 -4.634 -0.650 2.536 -9.204 -0.650 -9.204 -4.634 -9.204 -9.204 -4.634 -5.837 -9.204 -0.650 2.536 -6.626 -9.204 -9.204 -4.634 -9.204 -0.650 9.644 1.300 -9.204 electronvolt
mo.energy: -0.305 electronvolt
energy: -4.634 -4.634 -4.634 -9.204 -9.204 1.300 -9.204 -9.204 -0.650 -9.204 -4.634 -4.634 -9.204 -0.650 -6.626 -9.204 -9.204 -9.204 1.300 -0.650 -0.650 -9.204 -4.634 -5.837 -9.204 -9.204 -9.204 -9.204 -0.650 -4.634 -4.634 -9.204 9.644 -0.650 electronvolt
mo.energy: -0.199 electronvolt
energy: -5.837 -5.837 -6.626 -6.626 2.536 2.536 1.300 1.300 -9.204 -4.634 -4.634 -9.204 -4.634 9.644 9.644 -4.634 -4.634 -9.204 -9.204 -9.204 electronvolt
mo.energy: 0.969 electronvolt
energy: -6.626 -6.626 2.536 2.536 -5.837 -5.837 9.644 9.644 9.644 -9.204 -9.204 3.974 9.644 1.300 1.300 electronvolt
mo.energy: 1.195 electronvolt
energy: -5.837 -5.837 -6.626 -6.626 2.536 2.536 1.300 1.300 -0.650 9.644 9.644 24.443 24.443 -0.650 electronvolt
title: Oxygen (TZP, 1s frozen)
title: Tungsten (TZP, 4d frozen)
title: *** (NO TITLE) ***
