charge: 0
program: ADF
programVersion: 2019
title: Hydrogen (TZP)
runtype: SINGLE POINT
method: DFT
functional: Becke88 Perdew86
basis: TZP
formula: H2O4W
InChI: InChI=1/2H2O.2O.W/h2*1H2;;;/q;;;;+2/p-2/rH2O4W/c1-5(2,3)4/h1-2H
7 atoms
W  0.2207 1.2493 2.7614
O  1.2544 -0.3238 2.5517
O  -0.6602 1.5987 1.3121
O  1.2612 2.7422 3.2863
O  -0.9013 0.9440 4.0510
H  1.5803 3.3383 2.5761
H  1.5631 -0.5409 1.6467
functional: VWN
spinMolecule: Restricted
epsl: 78.39000
energy: -10.516 -10.464 -10.298 -9.927 -9.296 -9.120 -8.536 -8.404 -8.002 -7.572 -2.739 -2.568 -1.288 -1.017 -0.700 -0.415 0.600 1.318 3.627 4.283 electronvolt
elementType: W O O O O H H
charge: 2.4037 -0.7731 -0.7796 -0.7730 -0.7803 0.3511 0.3512
mdcq: 0.627565 -0.396399 -0.295617 -0.341899 -0.326889 0.348933 0.384306
dipole: 4.97315972 0.71548176 -3.10866119
dipole: 5.90829977
quadrupole: 6.38151369 8.29174422 9.76679701 12.32498170 0.41178482 -18.70649539
eener: -35.9787 electronvolt
kinener: 43.0028 electronvolt
coulombener: -16.0376 electronvolt
xcener: -38.1854 electronvolt
solvener: -0.8353 electronvolt
total: -48.0341 electronvolt
mo.energy: -25.415 electronvolt
energy: -24.141 -24.141 -6.626 -6.626 -5.837 -9.204 -9.204 electronvolt
mo.energy: -25.221 electronvolt
energy: -24.141 -24.141 -6.626 -6.626 -4.634 -0.650 -9.204 -9.204 3.974 electronvolt
mo.energy: -23.257 electronvolt
energy: -24.141 -24.141 -4.634 -43.331 electronvolt
mo.energy: -22.929 electronvolt
mo.energy: -13.245 electronvolt
energy: -9.204 -9.204 -9.204 -9.204 -6.626 -9.204 -9.204 -6.626 -4.634 2.536 -4.634 -24.141 -4.634 -5.837 2.536 electronvolt
mo.energy: -13.241 electronvolt
energy: -9.204 -9.204 -9.204 -6.626 -4.634 -9.204 -4.634 -6.626 -9.204 -9.204 -24.141 -9.204 2.536 electronvolt
mo.energy: -10.516 electronvolt
energy: -9.204 -4.634 -9.204 -9.204 -4.634 -9.204 -9.204 -9.204 -9.204 -9.204 -4.634 -24.141 -9.204 -0.650 3.974 electronvolt
mo.energy: -10.464 electronvolt
energy: -9.204 -9.204 -9.204 -4.634 -4.634 -9.204 -9.204 -4.634 -24.141 -24.141 3.974 -9.204 electronvolt
mo.energy: -10.298 electronvolt
energy: -4.634 -9.204 -9.204 -9.204 -9.204 -4.634 -9.204 -4.634 -9.204 -9.204 3.974 -9.204 electronvolt
mo.energy: -9.927 electronvolt
energy: -9.204 -9.204 -9.204 -4.634 -4.634 -9.204 -9.204 -24.141 -9.204 -9.204 -4.634 -0.650 -9.204 -4.634 3.974 electronvolt
mo.energy: -9.296 electronvolt
energy: -9.204 -9.204 -9.204 -9.204 -9.204 -4.634 -9.204 -9.204 -24.141 -9.204 -9.204 -24.141 -24.141 3.974 electronvolt
mo.energy: -9.120 electronvolt
energy: -9.204 -4.634 -9.204 -9.204 -9.204 -4.634 -9.204 -0.650 -4.634 -9.204 -9.204 electronvolt
mo.energy: -8.536 electronvolt
energy: -9.204 -9.204 -9.204 -9.204 -9.204 -9.204 -4.634 -9.204 electronvolt
mo.energy: -8.404 electronvolt
energy: -9.204 -9.204 -9.204 -9.204 -9.204 -9.204 -9.204 -9.204 -9.204 -0.650 -9.204 electronvolt
mo.energy: -8.002 electronvolt
energy: -9.204 -9.204 -9.204 -9.204 -9.204 -9.204 -9.204 -9.204 electronvolt
mo.energy: -7.572 electronvolt
energy: -9.204 -9.204 -9.204 -9.204 electronvolt
mo.energy: -2.739 electronvolt
energy: -4.634 -9.204 -9.204 -4.634 3.974 -4.634 -6.626 -6.626 -9.204 electronvolt
mo.energy: -2.568 electronvolt
energy: -4.634 -9.204 -9.204 -9.204 -9.204 -4.634 -9.204 3.974 -9.204 -0.650 -9.204 electronvolt
mo.energy: -1.288 electronvolt
energy: -4.634 -9.204 -9.204 -9.204 -9.204 -4.634 -0.650 -9.204 9.644 9.644 -24.141 electronvolt
mo.energy: -1.017 electronvolt
energy: -5.837 1.300 -4.634 -6.626 -6.626 2.536 2.536 -4.634 24.443 24.443 -9.204 -9.204 -24.141 -24.141 electronvolt
mo.energy: -0.700 electronvolt
energy: -4.634 -0.650 -9.204 -9.204 -4.634 20.477 -5.837 -9.204 electronvolt
mo.energy: -0.415 electronvolt
energy: -4.634 -9.204 -9.204 -4.634 -0.650 1.300 -5.837 -9.204 -9.204 -6.626 -6.626 2.536 2.536 -4.634 9.644 9.644 electronvolt
mo.energy: 0.600 electronvolt
energy: -6.626 -6.626 2.536 2.536 3.974 -0.650 9.644 -9.204 -9.204 9.644 9.644 10.872 -9.204 24.443 24.443 electronvolt
mo.energy: 1.318 electronvolt
energy: -5.837 -6.626 -6.626 1.300 2.536 2.536 -0.650 9.644 9.644 24.443 9.644 9.644 -9.204 41.229 41.229 electronvolt
title: Oxygen (TZP, 1s frozen)
title: Tungsten (TZP, 4d frozen)
title: *** (NO TITLE) ***
