title: Memory allocated for RI-J 500 MByte
elementType: c
basis: def-SV(P)
elementType: n
elementType: h
elementType: o
method: dft
functional: b-p
elementType: c n h o
basis: def-SV(P) def-SV(P) def-SV(P) def-SV(P)
energy: -6738.524403005 hartree
formula: C141H115N21O2
InChI: InChI=1/C128H104N16.C8H7NO.C5H4N4O/c1-121-89-25-41-97(42-26-89)129-73-81-9-11-82(12-10-81)76-132-101-49-33-93(34-50-101)125(5)113-65-67-115(141-113)126(6)94-35-51-102(52-36-94)134-78-85-17-13-83(14-18-85)74-130-98-43-27-90(28-44-98)122(2,107-59-57-105(121)137-107)109-61-63-111(139-109)124(4)92-31-47-100(48-32-92)133-77-87-21-23-88(24-22-87)80-136-104-55-39-96(40-56-104)128(8,119-71-69-117(126)143-119)120-72-70-118(144-120)127(7,116-68-66-114(125)142-116)95-37-53-103(54-38-95)135-79-86-19-15-84(16-20-86)75-131-99-45-29-91(30-46-99)123(3,108-60-58-106(121)138-108)110-62-64-112(124)140-110;1-2-5-9-6-3-8(10)4-7-9;6-8-7-5-1-3-9(10)4-2-5/h9-80,137-144H,1-8H3;1,3-4,6-7H,5H2;1-4H
279 atoms
C  -1.90006306 -4.48098208 -1.74841282
C  -4.42619819 -2.32245382 3.05180877
C  -6.51886727 1.86455314 1.45904071
C  -3.42047609 0.70963206 -3.43832735
N  -2.2782379 -4.48414829 -2.98777412
N  -4.33759295 -3.39819121 2.33779273
N  -7.26923752 1.15752437 2.24428013
N  -4.5203951 0.68935902 -2.75626972
C  5.13638954 7.66598159 2.65744139
C  5.88312759 8.65256407 2.009707
H  5.79325091 9.73377297 2.1623569
C  6.79035313 7.9970095 1.12073217
H  7.50970386 8.48529411 0.45412269
C  6.58418743 6.62067751 1.23924054
C  7.11708092 5.47417951 0.39000848
C  5.9506723 4.85029637 -0.41668493
C  6.04006041 3.54423725 -0.94693915
H  6.96723584 2.96762467 -0.79407839
C  4.95777309 2.9633842 -1.62168106
H  5.01653437 1.93383927 -2.00931025
C  3.72511145 3.6537687 -1.72643686
C  3.67100227 5.00112695 -1.29235921
H  2.75577554 5.59095803 -1.46006652
C  4.77496353 5.58674053 -0.66626783
H  4.73091074 6.6402184 -0.3471348
C  8.13568233 6.03889016 -0.62900085
H  8.5196005 5.22472937 -1.27735943
H  8.99169832 6.51428506 -0.10530113
H  7.64703159 6.79573761 -1.27620789
C  7.79194175 4.38597278 1.21214684
C  9.09155375 3.87903298 1.14400118
H  9.89988966 4.26431922 0.51262198
C  9.17331727 2.76471624 2.03625898
H  10.05667676 2.14306296 2.22054297
C  7.9212871 2.61139336 2.63423768
C  7.4081525 1.56495994 3.61410193
C  6.16290115 0.86856245 3.01302163
C  6.20403671 0.44650968 1.66140202
H  7.081871 0.71517314 1.05055989
C  5.17694461 -0.31136471 1.0985908
H  5.27284463 -0.64503124 0.05322358
C  4.03049122 -0.65705961 1.86475771
C  3.9828099 -0.21869724 3.2083251
H  3.09568835 -0.48291797 3.80613254
C  5.02670601 0.52779122 3.77143648
H  4.95952844 0.84695665 4.82058847
C  8.48574593 0.45953544 3.76734371
H  8.12312184 -0.32979497 4.45729022
H  9.42433774 0.88716729 4.17566318
H  8.70956516 -0.00298938 2.78437402
C  7.14911496 2.15939939 4.99059034
C  7.81099329 1.9419243 6.20200027
H  8.66978659 1.28021842 6.35862077
C  7.17023076 2.74149952 7.19818423
H  7.43533965 2.78994927 8.26018449
C  6.1284561 3.43540891 6.58003647
C  4.99702827 4.25713849 7.1836177
C  3.66337045 3.51279133 6.93019199
C  3.64978306 2.10390505 6.83658027
H  4.59262113 1.55294494 6.98798997
C  2.47507669 1.40547827 6.55131815
H  2.49762125 0.30586505 6.49054931
C  1.25583195 2.10228389 6.35200846
C  1.24406088 3.50085764 6.57140816
H  0.28608721 4.03512851 6.46741924
C  2.43285315 4.19501403 6.83464555
H  2.41688533 5.29005783 6.94851846
C  5.19652656 4.34355691 8.71578823
H  4.3686394 4.92266108 9.1740232
H  6.15887727 4.8428966 8.95640899
H  5.20125906 3.32762317 9.16118943
C  4.92859997 5.66413085 6.61457562
C  5.08861175 6.90992177 7.22699352
H  5.36912418 7.08277067 8.27223422
C  4.81493246 7.9149717 6.24591187
H  4.84763753 8.99991261 6.39866278
C  4.49450914 7.26134137 5.05461989
C  4.036123 7.7889996 3.7019693
C  2.74516949 7.03744663 3.29799363
C  1.74267643 6.82637101 4.27376793
H  1.92537596 7.17288225 5.30420645
C  0.5323604 6.20771933 3.95758425
H  -0.23731554 6.10022863 4.73773806
C  0.27664581 5.75492957 2.63550253
C  1.26901776 5.98804514 1.65583075
H  1.06479036 5.65748371 0.62504436
C  2.47941285 6.61268054 1.98252929
H  3.23395772 6.77454366 1.20179648
C  3.66379727 9.28600323 3.84616203
H  2.86105481 9.41243791 4.60121316
H  3.30635547 9.68499916 2.8746321
H  4.54555122 9.8773991 4.17062638
N  5.58700746 6.44595054 2.18459653
N  7.10137981 3.60124104 2.12097943
N  6.14264164 3.07506974 5.24313594
N  4.57499793 5.90405093 5.30038686
H  6.11673666 3.74203394 2.41471112
H  5.17003059 5.54038989 2.45922413
H  4.35983419 5.17887735 4.58972924
H  5.46460479 3.40089703 4.53410601
H  -2.54120351 -4.90722222 -0.93794314
H  -5.40942343 -1.86498071 3.32245068
H  -6.7029958 1.90920379 0.3578049
H  -3.34666306 0.26156357 -4.4589624
C  -8.77539085 -6.95424116 -0.89541424
C  -8.95879864 -8.24593924 -1.39212547
H  -9.30670699 -9.11345214 -0.82032026
C  -8.61572851 -8.22925467 -2.78058446
H  -8.63868124 -9.08559755 -3.4640738
C  -8.22900284 -6.92772699 -3.10812815
C  -7.58196677 -6.37674525 -4.37092835
C  -6.13764025 -5.92176388 -4.03855569
C  -5.48186308 -4.92431 -4.792026
H  -6.01405841 -4.45911863 -5.63695723
C  -4.18040463 -4.51356204 -4.46796386
H  -3.67457811 -3.72191331 -5.04281774
C  -3.50349767 -5.0586112 -3.34845786
C  -4.12691918 -6.12444841 -2.64852278
H  -3.59181042 -6.63400774 -1.8318081
C  -5.41395916 -6.54547032 -2.99773173
H  -5.88499432 -7.38042816 -2.45359612
C  -7.47012099 -7.51183591 -5.41683464
H  -6.97656476 -7.13539654 -6.33608006
H  -8.47701426 -7.89627607 -5.68313294
H  -6.86361419 -8.34735142 -5.01084828
C  -8.37082411 -5.2252379 -4.97529141
C  -8.94333873 -5.07856695 -6.24101336
H  -8.97570289 -5.84281894 -7.02576156
C  -9.47581942 -3.75301577 -6.32877701
H  -9.9905608 -3.31459917 -7.19120668
C  -9.21911363 -3.1154963 -5.11462857
C  -9.46708396 -1.68529153 -4.6542001
C  -8.14483491 -1.08493467 -4.12117903
C  -6.91795117 -1.4326086 -4.73192001
H  -6.92095315 -2.17333139 -5.54696313
C  -5.70992425 -0.86920547 -4.31669371
H  -4.7759683 -1.19877386 -4.79752865
C  -5.67756429 0.07598653 -3.25831019
C  -6.90276757 0.40918198 -2.63764534
H  -6.87689305 1.12765087 -1.80344305
C  -8.11287624 -0.14412064 -3.0737126
H  -9.05067614 0.14802119 -2.58120314
C  -9.88870575 -0.83204816 -5.87615143
H  -10.05539021 0.22033379 -5.56654474
H  -10.82729149 -1.2236992 -6.32049717
H  -9.09572175 -0.85524088 -6.6522329
C  -10.56929417 -1.61597612 -3.60747913
C  -11.87339853 -1.12279322 -3.68188098
H  -12.3547772 -0.70327079 -4.57252116
C  -12.46563211 -1.26650305 -2.38752678
H  -13.47982982 -0.96544993 -2.10161051
C  -11.51322976 -1.84491464 -1.54519071
C  -11.52337428 -2.06182032 -0.03779635
C  -10.42600396 -1.17632938 0.60521677
C  -10.07709999 0.05757034 0.01244756
H  -10.61603558 0.3798843 -0.89384957
C  -9.07276291 0.86679 0.54896707
H  -8.83714374 1.82769055 0.06450282
C  -8.37056528 0.46885608 1.71678047
C  -8.79405669 -0.7129413 2.3726122
H  -8.28365744 -1.0011715 3.30532987
C  -9.79197711 -1.52757516 1.81606026
H  -10.07954317 -2.46565811 2.31691902
C  -12.88126226 -1.58417572 0.53150853
H  -12.89756949 -1.71200788 1.63349907
H  -13.71571745 -2.16882524 0.09044938
H  -13.03737897 -0.51037696 0.3012808
C  -11.31849129 -3.52079436 0.33640961
C  -12.13406992 -4.40398146 1.04786936
H  -13.14199515 -4.19007912 1.42119139
C  -11.41598109 -5.6321979 1.2040249
H  -11.77051772 -6.53199221 1.71958688
C  -10.17623014 -5.47580564 0.58335358
C  -8.9601375 -6.39003193 0.5050554
C  -7.72076127 -5.58963055 0.97152791
C  -7.84261733 -4.71783798 2.07788653
H  -8.82331357 -4.62292969 2.57173498
C  -6.75312235 -3.99045621 2.55879358
H  -6.88472873 -3.34877462 3.44361634
C  -5.48071909 -4.09565227 1.93540577
C  -5.35150676 -4.99577309 0.853389
H  -4.36125117 -5.09722992 0.38284001
C  -6.44909062 -5.72750374 0.38244497
H  -6.31497201 -6.4149999 -0.46301882
C  -9.15118758 -7.56840434 1.49105612
H  -9.27780272 -7.18810992 2.52544299
H  -8.26518462 -8.23554165 1.46119167
H  -10.05066873 -8.16128513 1.22332783
N  -8.34825445 -6.17302868 -1.95374789
N  -8.55724812 -4.02554525 -4.31123459
N  -10.37946971 -2.05758187 -2.3107231
N  -10.14333937 -4.19615669 0.06071249
H  -8.21958366 -3.7972456 -3.36093309
H  -8.08027786 -5.18001483 -1.84968448
H  -9.31838326 -3.80556625 -0.42419336
H  -9.47808858 -2.43093432 -1.96706378
N  2.93156633 -1.39126742 1.39799847
N  0.07481064 1.49199486 5.91747764
N  -0.90008782 5.12012005 2.22788501
N  2.60858809 2.96769307 -2.21376821
C  2.75073967 -1.66391408 0.14316857
C  0.14709216 0.43619192 5.17065993
C  -1.68247223 4.53158069 3.07526515
C  1.45860307 3.18297573 -1.65725689
C  -0.66570903 -3.84404071 -1.29189556
C  0.24212122 -3.24386704 -2.19823241
H  0.02687416 -3.31507922 -3.27547766
C  1.35855852 -2.55736081 -1.72186358
H  2.05299219 -2.0766183 -2.43136597
C  1.60268729 -2.43909395 -0.32911008
C  0.70791786 -3.06513599 0.57530956
H  0.91878537 -2.9918614 1.65308336
C  -0.40514004 -3.75785882 0.09979834
H  -1.10866504 -4.23267762 0.80496265
C  -2.19117319 1.33672938 -2.95557756
C  -0.99705176 1.17021475 -3.70311916
H  -1.02170973 0.56849146 -4.62750825
C  0.19637285 1.75086108 -3.28005787
H  1.13273692 1.62823889 -3.84626244
C  0.22344215 2.54028449 -2.10475109
C  -0.96793943 2.70669857 -1.35263923
H  -0.9436253 3.30777295 -0.42736967
C  -2.15622689 2.10323131 -1.76526457
H  -3.07932622 2.20332012 -1.17564938
C  -5.34300885 2.60589441 1.91016438
C  -4.56997107 3.3178271 0.95519097
H  -4.8987235 3.32579633 -0.09769374
C  -3.40306857 3.98092398 1.33143254
H  -2.78983613 4.52559302 0.59804402
C  -2.95844991 3.93773126 2.67643193
C  -3.75574806 3.26713097 3.63938109
H  -3.42084852 3.24571065 4.68965733
C  -4.93073765 2.61214051 3.26603896
H  -5.55090652 2.07696994 4.00139048
C  -3.25532265 -1.62238783 3.57161286
C  -3.43437282 -0.5068356 4.42858203
H  -4.45885154 -0.17356016 4.6647489
C  -2.33672599 0.15568977 4.97529695
H  -2.45667832 1.02147746 5.6440
C  -1.02419033 -0.27029534 4.6642089
C  -0.84391046 -1.38233028 3.80283326
H  0.18216839 -1.70632515 3.55713995
C  -1.94123823 -2.05106248 3.26587525
H  -1.8217868 -2.91455616 2.59541426
H  3.43903672 -1.29911434 -0.65713005
H  1.13049975 0.03057195 4.82870838
H  -1.42068937 4.42218508 4.15610259
H  1.360086 3.85413223 -0.76952931
C  3.5125238 3.37550358 2.67759522
C  3.66014371 2.70597089 1.42283477
C  2.65540693 1.90657389 0.93491166
N  1.47125595 1.7587306 1.60252943
C  1.26519528 2.42654261 2.77877068
C  2.24314292 3.22806303 3.32584275
O  4.47775483 4.06151829 3.18918935
C  0.50668996 0.74505468 1.10904019
C  -0.87112354 1.00244399 1.48303976
N  -1.28272104 -0.83282134 -0.87699821
N  -2.36143569 -0.88301705 -0.48886941
N  -6.88295667 -2.77796522 -1.20966149
C  -5.71728615 -2.9908255 -1.88062076
C  -4.55040263 -2.35155982 -1.49267319
C  -4.56748228 -1.47605232 -0.38775991
C  -5.78541747 -1.28344866 0.2929114
C  -6.92549309 -1.940607 -0.13371102
O  -7.98797241 -3.38759409 -1.60505171
N  -3.45442823 -0.78538883 0.08344727
C  -2.04217008 1.13106995 1.7988857
H  0.60693923 0.70437504 0.00372719
H  0.83682661 -0.24635934 1.49866209
H  4.59871411 2.7959391 0.86353469
H  2.75133854 1.34761559 -0.00490532
H  0.27694107 2.28563163 3.23833177
H  2.05195304 3.75982545 4.26700938
H  -5.78639875 -3.66886101 -2.74016142
H  -3.63545784 -2.52802426 -2.07427827
H  -5.83745686 -0.61735441 1.16230674
H  -7.90451858 -1.85015442 0.35137609
H  -3.07868992 1.2157573 2.09102153
converged: yes
orbitalenergy: -4.8345 -4.8040 -4.6975 -4.4657 -4.3394 -3.7948 -3.7228 -3.6495 -3.6042 -3.2597 electronvolt
charge: -0.000000
dipole: -3652.116106 3651.538408 -0.577698 603.989919 -604.775443 -0.785524 1614.687326 -1615.394938 -0.707613
quadrupole: 156944.342974 -157726.213537 -781.870563 67794.740556 -68534.237687 -739.497130 47395.952056 -48109.170494 -713.218438 66684.179567 -66738.190165 -54.010597 37492.301399 -37530.413925 -38.112526 29516.367057 -29532.497348 -16.130291
